BDBM318277 US10301317, Example 234::US9624228, Example 234
SMILES CC(N1Cc2cc3c(n[nH]c3cc2NC1=O)-c1ccnc(C)c1)c1nccs1
InChI Key
Data  2 IC50
  Tab Delimited (TSV)   2D SDfile   Computed 3D by Vconf -m prep SDfile
Find this compound or compounds like it in BindingDB:
Activity Spreadsheet -- Enzyme Inhibition Constant Data from BindingDB
Found 2 hits for monomerid = 318277
TargetMitogen-activated protein kinase 1(Homo sapiens (Human))
Kura Oncology
US Patent
LigandPNGBDBM318277(US10301317, Example 234 | US9624228, Example 234)
Affinity DataIC50: <50nM. Assay description: The inhibition of ERK activity by the compounds disclosed herein was determined using the Z′-LYTE kinase assay kit (Life Technologies) with a S...
Ligand InfoPC cidPC sid
In DepthDetails US Patent
TargetMitogen-activated protein kinase 1(Homo sapiens (Human))
Kura Oncology
US Patent
LigandPNGBDBM318277(US10301317, Example 234 | US9624228, Example 234)
Affinity DataIC50: <50nM. Assay description: The inhibition of ERK activity by the compounds disclosed herein was determined using the Z′-LYTE kinase assay kit (Life Technologies) with a S...
Ligand InfoPC cidPC sid
In DepthDetails US Patent