BDBM318295 US10301317, Example 252::US9624228, Example 252
SMILES Cc1cc(ccn1)-c1n[nH]c2cc3NC(=O)N(Cc3cc12)[C@@H]1CCCN(Cc2ccsc2)C1
InChI Key
Data  2 IC50
  Tab Delimited (TSV)   2D SDfile   Computed 3D by Vconf -m prep SDfile
Find this compound or compounds like it in BindingDB:
Activity Spreadsheet -- Enzyme Inhibition Constant Data from BindingDB
Found 2 hits for monomerid = 318295
TargetMitogen-activated protein kinase 1(Homo sapiens (Human))
Kura Oncology
US Patent
LigandPNGBDBM318295(US10301317, Example 252 | US9624228, Example 252)
Affinity DataIC50: <50nM. Assay description: The inhibition of ERK activity by the compounds disclosed herein was determined using the Z′-LYTE kinase assay kit (Life Technologies) with a S...
Ligand InfoPC cidPC sid
In DepthDetails US Patent
TargetMitogen-activated protein kinase 1(Homo sapiens (Human))
Kura Oncology
US Patent
LigandPNGBDBM318295(US10301317, Example 252 | US9624228, Example 252)
Affinity DataIC50: <50nM. Assay description: The inhibition of ERK activity by the compounds disclosed herein was determined using the Z′-LYTE kinase assay kit (Life Technologies) with a S...
Ligand InfoPC cidPC sid
In DepthDetails US Patent