BDBM318418 US10301317, Example 376::US9624228, Example 376
SMILES Cc1cc(ccn1)-c1n[nH]c2cc3NC(=O)N(Cc3cc12)[C@@H]1CN(CCO)C[C@H]1c1ccccc1
InChI Key
Data  2 IC50
  Tab Delimited (TSV)   2D SDfile   Computed 3D by Vconf -m prep SDfile
Find this compound or compounds like it in BindingDB:
Activity Spreadsheet -- Enzyme Inhibition Constant Data from BindingDB
Found 2 hits for monomerid = 318418
TargetMitogen-activated protein kinase 1(Homo sapiens (Human))
Kura Oncology
US Patent
LigandPNGBDBM318418(US10301317, Example 376 | US9624228, Example 376)
Affinity DataIC50: <50nM. Assay description: The inhibition of ERK activity by the compounds disclosed herein was determined using the Z′-LYTE kinase assay kit (Life Technologies) with a S...
Ligand InfoPC cidPC sid
In DepthDetails US Patent
TargetMitogen-activated protein kinase 1(Homo sapiens (Human))
Kura Oncology
US Patent
LigandPNGBDBM318418(US10301317, Example 376 | US9624228, Example 376)
Affinity DataIC50: <50nM. Assay description: The inhibition of ERK activity by the compounds disclosed herein was determined using the Z′-LYTE kinase assay kit (Life Technologies) with a S...
Ligand InfoPC cidPC sid
In DepthDetails US Patent