BDBM318448 NSC332397::US9624235, Compound 6
SMILES Cc1cc(N\N=C\c2ccc(o2)[N+]([O-])=O)c2cc3OCOc3cc2n1
InChI Key InChIKey=IEKHHPHABYSIRE-REZTVBANSA-N
Data  1 KI
  Tab Delimited (TSV)   2D SDfile   Computed 3D by Vconf -m prep SDfile
Find this compound or compounds like it in BindingDB:
Activity Spreadsheet -- Enzyme Inhibition Constant Data from BindingDB
Found 1 hit for monomerid = 318448
TargetDNA-(apurinic or apyrimidinic site) endonuclease(Homo sapiens (Human))
University Of Pittsburgh
US Patent
LigandPNGBDBM318448(NSC332397 | US9624235, Compound 6)
Affinity DataKi:  640nM. Assay description: The initial screen was designed to look at the effect of potential inhibitors on APE1 repair kinetics. The approach can be used as a high throughput ...
Ligand InfoPC cidPC sid
In DepthDetails US Patent