BDBM318673 N-{(3R)-1-[(4S)-7-(3,5- dimethylisoxazol-4-yl)-4-pyridin-2-yl- 4,5-dihydroimidazo[1,5,4- de][1,4]benzoxazin-2-yl]pyrrolidin-3- yl}acetamide::US10464947, Example 201A::US9624241, Example 201A
SMILES CC(=O)N[C@@H]1CCN(C1)c1nc2ccc(-c3c(C)noc3C)c3OC[C@H](c4ccccn4)n1c23
InChI Key InChIKey=UOBOUYUPNGQMRM-DYESRHJHSA-N
Data  4 IC50
  Tab Delimited (TSV)   2D SDfile   Computed 3D by Vconf -m prep SDfile
Find this compound or compounds like it in BindingDB:
Activity Spreadsheet -- Enzyme Inhibition Constant Data from BindingDB
Found 4 hits for monomerid = 318673
TargetBromodomain-containing protein 4 [49-170](Homo sapiens (Human))
Incyte
US Patent
LigandPNGBDBM318673(N-{(3R)-1-[(4S)-7-(3,5- dimethylisoxazol-4-yl)-4-p...)
Affinity DataIC50: <100nM. Assay description: BRD4-BD1 and BRD4-BD2 assays were conducted in white 384-well polystyrene plate in a final volume of 20 μL for BD1 and 40 μL for BD2. Inhib...
Ligand InfoPC cidPC sid
In DepthDetails US Patent
TargetBromodomain-containing protein 4 [342-460](Homo sapiens (Human))
Incyte Holdings
US Patent
LigandPNGBDBM318673(N-{(3R)-1-[(4S)-7-(3,5- dimethylisoxazol-4-yl)-4-p...)
Affinity DataIC50: <100nM. Assay description: BRD4-BD1 and BRD4-BD2 assays were conducted in white 384-well polystyrene plate in a final volume of 40 μL for BD1 and 60 μL for BD2. Inhib...
Ligand InfoPC cidPC sid
In DepthDetails US Patent
TargetBromodomain-containing protein 4 [42-168](Homo sapiens (Human))
Incyte Holdings
US Patent
LigandPNGBDBM318673(N-{(3R)-1-[(4S)-7-(3,5- dimethylisoxazol-4-yl)-4-p...)
Affinity DataIC50: <100nM. Assay description: BRD4-BD1 and BRD4-BD2 assays were conducted in white 384-well polystyrene plate in a final volume of 40 μL for BD1 and 60 μL for BD2. Inhib...
Ligand InfoPC cidPC sid
In DepthDetails US Patent
TargetBromodomain-containing protein 4 [342-460](Homo sapiens (Human))
Incyte Holdings
US Patent
LigandPNGBDBM318673(N-{(3R)-1-[(4S)-7-(3,5- dimethylisoxazol-4-yl)-4-p...)
Affinity DataIC50: <100nM. Assay description: BRD4-BD1 and BRD4-BD2 assays were conducted in white 384-well polystyrene plate in a final volume of 20 μL for BD1 and 40 μL for BD2. Inhib...
Ligand InfoPC cidPC sid
In DepthDetails US Patent