BDBM318752 (2S,4S)-1-(2,2-diphenylacetyl)-4-(4-phenylpiperazine)pyrrolidine-2-carboxylic acid::US9624243, 23
SMILES OC(=O)[C@@H]1CC(CN1C(=O)C(c1ccccc1)c1ccccc1)N1CCN(CC1)c1ccccc1
InChI Key InChIKey=XYLRMVKCCBZNNZ-AMVUTOCUSA-N
Data  1 IC50
  Tab Delimited (TSV)   2D SDfile   Computed 3D by Vconf -m prep SDfile
Find this compound or compounds like it in BindingDB:
Activity Spreadsheet -- Enzyme Inhibition Constant Data from BindingDB
Found 1 hit for monomerid = 318752
TargetType-2 angiotensin II receptor(Homo sapiens (Human))
Novartis
US Patent
LigandPNGBDBM318752( (2S,4S)-1-(2,2-diphenylacetyl)-4-(4-phenylpiperaz...)
Affinity DataIC50:  290nM. Assay description:  120 μL membrane (5 mg protein/well) was incubated with 15 μL of [125I]-CGP42112A and 15 μL of compound at RT for 1.5 hrs. ...
Ligand InfoPC cidPC sid
In DepthDetails US Patent