BDBM318778 (2S,4S)-4-((4aR,7aR)-6-benzoctahydro-1H-pyrrolo[3,4-b]-pyridin-1-yl)-1-(2,2-diphenylacetyl)pyrrolidine-2-carboxylic acid::US9624243, 85
SMILES COC(=O)[C@@H]1CC(CN1C(=O)C(c1ccccc1)c1ccccc1)N1CCC[C@@H]2CN(C[C@H]12)c1ccccc1
InChI Key InChIKey=XKQFTBHOSCAIIQ-NETNXBRUSA-N
Data  1 IC50
  Tab Delimited (TSV)   2D SDfile   Computed 3D by Vconf -m prep SDfile
Find this compound or compounds like it in BindingDB:
Activity Spreadsheet -- Enzyme Inhibition Constant Data from BindingDB
Found 1 hit for monomerid = 318778
TargetType-2 angiotensin II receptor(Homo sapiens (Human))
Novartis
US Patent
LigandPNGBDBM318778((2S,4S)-4-((4aR,7aR)-6-benzoctahydro-1H-pyrrolo[3,...)
Affinity DataIC50:  103nM. Assay description:  120 μL membrane (5 mg protein/well) was incubated with 15 μL of [125I]-CGP42112A and 15 μL of compound at RT for 1.5 hrs. ...
Ligand InfoPC cidPC sid
In DepthDetails US Patent