BDBM318786 (2S,4S)-1-(2,2-diphenylacetyl)-4-(3-phenylpropanamido)-pyrrolidine-2-carboxylic acid::US9624243, 96
SMILES OC(=O)[C@@H]1C[C@@H](CN1C(=O)C(c1ccccc1)c1ccccc1)NC(=O)CCc1ccccc1
InChI Key InChIKey=MOWSLAHDBCUMSN-ZEQRLZLVSA-N
Data  1 IC50
  Tab Delimited (TSV)   2D SDfile   Computed 3D by Vconf -m prep SDfile
Find this compound or compounds like it in BindingDB:
Activity Spreadsheet -- Enzyme Inhibition Constant Data from BindingDB
Found 1 hit for monomerid = 318786
TargetType-2 angiotensin II receptor(Homo sapiens (Human))
Novartis
US Patent
LigandPNGBDBM318786( (2S,4S)-1-(2,2-diphenylacetyl)-4-(3-phenylpropana...)
Affinity DataIC50:  2.25E+3nM. Assay description:  120 μL membrane (5 mg protein/well) was incubated with 15 μL of [125I]-CGP42112A and 15 μL of compound at RT for 1.5 hrs. ...
Ligand InfoPC cidPC sid
In DepthDetails US Patent