BDBM318818 (S)-1-(2,2-diphenylacetyl)-4-(3-phenylthiophen-2-yl)-2,5-dihydro-1H-pyrrole-2-carboxylic acid::US10370388, Compound 139::US9624243, 139
SMILES OC(=O)[C@@H]1C=C(CN1C(=O)C(c1ccccc1)c1ccccc1)c1sccc1-c1ccccc1
InChI Key InChIKey=OERKEVDGARSKPT-VWLOTQADSA-N
Data  2 IC50
  Tab Delimited (TSV)   2D SDfile   Computed 3D by Vconf -m prep SDfile
Find this compound or compounds like it in BindingDB:
Activity Spreadsheet -- Enzyme Inhibition Constant Data from BindingDB
Found 2 hits for monomerid = 318818
TargetType-2 angiotensin II receptor(Homo sapiens (Human))
Novartis
US Patent
LigandPNGBDBM318818( (S)-1-(2,2-diphenylacetyl)-4-(3-phenylthiophen-2-...)
Affinity DataIC50:  2.53E+3nM. Assay description:  120 μL membrane (5 mg protein/well) was incubated with 15 μL of [125I]-CGP42112A and 15 μL of compound at RT for 1.5 hrs. ...
Ligand InfoPC cidPC sid
In DepthDetails US Patent
TargetType-2 angiotensin II receptor(Homo sapiens (Human))
Novartis
US Patent
LigandPNGBDBM318818( (S)-1-(2,2-diphenylacetyl)-4-(3-phenylthiophen-2-...)
Affinity DataIC50:  2.53E+3nM. Assay description:  120 μL membrane (5 mg protein/well) was incubated with 15 μL of [125I]-CGP42112A and 15 μL of compound at RT for 1.5 hrs. ...
Ligand InfoPC cidPC sid
In DepthDetails US Patent