BDBM318883 N-(2-cyano-3-(2-((4-(4-methylpiperazin-1-yl)phenyl)amino)quinazolin-8-yl)phenyl)acrylamide::US10172868, Compound C068::US10653701, Compound C068::US11304957, Compound C068
SMILES CN1CCN(CC1)c1ccc(Nc2ncc3cccc(-c4cccc(NC(=O)C=C)c4C#N)c3n2)cc1
InChI Key InChIKey=GITXJTGIQCEVPG-UHFFFAOYSA-N
Data  3 IC50
  Tab Delimited (TSV)   2D SDfile   Computed 3D by Vconf -m prep SDfile
Find this compound or compounds like it in BindingDB:
Activity Spreadsheet -- Enzyme Inhibition Constant Data from BindingDB
Found 3 hits for monomerid = 318883
TargetEpidermal growth factor receptor [T790M,L858R](Homo sapiens (Human))
Neupharma
US Patent
LigandPNGBDBM318883(N-(2-cyano-3-(2-((4-(4-methylpiperazin-1-yl)phenyl...)
Affinity DataIC50: <100nM. Assay description: The compound of Formula I binds to a kinase selected from the group consisting of EGFR, EGFR L858R, EGFR T790M, EGFR del E746-A750, or EGFR L858R/T79...
Ligand InfoPC cidPC sid
In DepthDetails US Patent
TargetEpidermal growth factor receptor [T790M,L858R](Homo sapiens (Human))
Neupharma
US Patent
LigandPNGBDBM318883(N-(2-cyano-3-(2-((4-(4-methylpiperazin-1-yl)phenyl...)
Affinity DataIC50: <100nM. Assay description: EGFR (T790M)(L858R):The 2×EGFR (ErbB1) T790M L858R/Tyr 04 mixture is prepared in 50 mM HEPES pH 6.5, 0.01% BRIJ-35, 10 mM MgCl2, 1 mM EGTA, 0.02% NaN...
Ligand InfoPC cidPC sid
In DepthDetails US Patent
TargetEpidermal growth factor receptor [T790M,L858R](Homo sapiens (Human))
Neupharma
US Patent
LigandPNGBDBM318883(N-(2-cyano-3-(2-((4-(4-methylpiperazin-1-yl)phenyl...)
Affinity DataIC50: <100nM. Assay description: (i) Peptide/Kinase Mixtures for measurement of EGFR (ErbB1):The 2×EGFR (ErbB1)/Tyr 04 mixture is prepared in 50 mM HEPES pH 7.5, 0.01% BRIJ-35, 10 mM...
Ligand InfoPC cidPC sid
In DepthDetails US Patent