BDBM318889 N-(3-(2-((4-((3-fluoro-1-methylpiperidin-4-yl)oxy)phenyl)amino)quinazolin-8-yl)phenyl)acrylamide::US10172868, Compound C079::US10653701, Compound C079::US11304957, Compound C079
SMILES CN1CCC(Oc2ccc(Nc3ncc4cccc(-c5cccc(NC(=O)C=C)c5)c4n3)cc2)C(F)C1
InChI Key InChIKey=FQCLNUWLGGCBFN-UHFFFAOYSA-N
Data  9 IC50
  Tab Delimited (TSV)   2D SDfile   Computed 3D by Vconf -m prep SDfile
Find this compound or compounds like it in BindingDB:
Activity Spreadsheet -- Enzyme Inhibition Constant Data from BindingDB
Found 9 hits for monomerid = 318889
TargetEpidermal growth factor receptor(Homo sapiens (Human))
Neupharma
US Patent
LigandPNGBDBM318889(N-(3-(2-((4-((3-fluoro-1-methylpiperidin-4-yl)oxy)...)
Affinity DataIC50:  300nM. Assay description: The compound of Formula I binds to a kinase selected from the group consisting of EGFR, EGFR L858R, EGFR T790M, EGFR del E746-A750, or EGFR L858R/T79...
Ligand InfoPC cidPC sid
In DepthDetails US Patent
TargetEpidermal growth factor receptor [T790M,L858R](Homo sapiens (Human))
Neupharma
US Patent
LigandPNGBDBM318889(N-(3-(2-((4-((3-fluoro-1-methylpiperidin-4-yl)oxy)...)
Affinity DataIC50: <100nM. Assay description: The compound of Formula I binds to a kinase selected from the group consisting of EGFR, EGFR L858R, EGFR T790M, EGFR del E746-A750, or EGFR L858R/T79...
Ligand InfoPC cidPC sid
In DepthDetails US Patent
TargetTyrosine-protein kinase BTK(Homo sapiens (Human))
Neupharma
US Patent
LigandPNGBDBM318889(N-(3-(2-((4-((3-fluoro-1-methylpiperidin-4-yl)oxy)...)
Affinity DataIC50: <100nM. Assay description: The compound of Formula I binds to a kinase selected from the group consisting of EGFR, EGFR L858R, EGFR T790M, EGFR del E746-A750, or EGFR L858R/T79...
Ligand InfoPC cidPC sid
In DepthDetails US Patent
TargetEpidermal growth factor receptor(Homo sapiens (Human))
Neupharma
US Patent
LigandPNGBDBM318889(N-(3-(2-((4-((3-fluoro-1-methylpiperidin-4-yl)oxy)...)
Affinity DataIC50:  300nM. Assay description: (i) Peptide/Kinase Mixtures for measurement of EGFR (ErbB1):The 2×EGFR (ErbB1)/Tyr 04 mixture is prepared in 50 mM HEPES pH 7.5, 0.01% BRIJ-35, 10 mM...
Ligand InfoPC cidPC sid
In DepthDetails US Patent
TargetTyrosine-protein kinase BTK(Homo sapiens (Human))
Neupharma
US Patent
LigandPNGBDBM318889(N-(3-(2-((4-((3-fluoro-1-methylpiperidin-4-yl)oxy)...)
Affinity DataIC50: <100nM. Assay description: BTK: The 2×BTK/Tyr 01 mixture is prepared in 50 mM HEPES pH 7.5, 0.01% BRIJ-35, 10 mM MgCl2, 1 mM EGTA. The final 10 μL Kinase Reaction consists...
Ligand InfoPC cidPC sid
In DepthDetails US Patent
TargetTyrosine-protein kinase BTK(Homo sapiens (Human))
Neupharma
US Patent
LigandPNGBDBM318889(N-(3-(2-((4-((3-fluoro-1-methylpiperidin-4-yl)oxy)...)
Affinity DataIC50: <100nM. Assay description: (i) Peptide/Kinase Mixtures for measurement of EGFR (ErbB1):The 2×EGFR (ErbB1)/Tyr 04 mixture is prepared in 50 mM HEPES pH 7.5, 0.01% BRIJ-35, 10 mM...
Ligand InfoPC cidPC sid
In DepthDetails US Patent
TargetEpidermal growth factor receptor(Homo sapiens (Human))
Neupharma
US Patent
LigandPNGBDBM318889(N-(3-(2-((4-((3-fluoro-1-methylpiperidin-4-yl)oxy)...)
Affinity DataIC50:  300nM. Assay description: EGFR: The 2×EGFR (ErbB1)/Tyr 04 mixture is prepared in 50 mM HEPES pH 7.5, 0.01% BRIJ-35, 10 mM MgCl2, 4 mM MnCl2, 1 mM EGTA, 2 mM DTT. The final 10 ...
Ligand InfoPC cidPC sid
In DepthDetails US Patent
TargetEpidermal growth factor receptor [T790M,L858R](Homo sapiens (Human))
Neupharma
US Patent
LigandPNGBDBM318889(N-(3-(2-((4-((3-fluoro-1-methylpiperidin-4-yl)oxy)...)
Affinity DataIC50: <100nM. Assay description: EGFR (T790M)(L858R):The 2×EGFR (ErbB1) T790M L858R/Tyr 04 mixture is prepared in 50 mM HEPES pH 6.5, 0.01% BRIJ-35, 10 mM MgCl2, 1 mM EGTA, 0.02% NaN...
Ligand InfoPC cidPC sid
In DepthDetails US Patent
TargetEpidermal growth factor receptor [T790M,L858R](Homo sapiens (Human))
Neupharma
US Patent
LigandPNGBDBM318889(N-(3-(2-((4-((3-fluoro-1-methylpiperidin-4-yl)oxy)...)
Affinity DataIC50: <100nM. Assay description: (i) Peptide/Kinase Mixtures for measurement of EGFR (ErbB1):The 2×EGFR (ErbB1)/Tyr 04 mixture is prepared in 50 mM HEPES pH 7.5, 0.01% BRIJ-35, 10 mM...
Ligand InfoPC cidPC sid
In DepthDetails US Patent