BDBM318899 N-(3-(2-((4-(2-methoxyethoxy)phenyl)amino)quinazolin-8-yl)phenyl)acrylamide::US10172868, Compound C107::US10653701, Compound C107::US11304957, Compound C107
SMILES COCCOc1ccc(Nc2ncc3cccc(-c4cccc(NC(=O)C=C)c4)c3n2)cc1
InChI Key InChIKey=RQECVRMOFHDYBX-UHFFFAOYSA-N
Data  9 IC50
  Tab Delimited (TSV)   2D SDfile   Computed 3D by Vconf -m prep SDfile
Find this compound or compounds like it in BindingDB:
Activity Spreadsheet -- Enzyme Inhibition Constant Data from BindingDB
Found 9 hits for monomerid = 318899
TargetEpidermal growth factor receptor(Homo sapiens (Human))
Neupharma
US Patent
LigandPNGBDBM318899(N-(3-(2-((4-(2-methoxyethoxy)phenyl)amino)quinazol...)
Affinity DataIC50: >500nM. Assay description: The compound of Formula I binds to a kinase selected from the group consisting of EGFR, EGFR L858R, EGFR T790M, EGFR del E746-A750, or EGFR L858R/T79...
Ligand InfoPC cidPC sid
In DepthDetails US Patent
TargetEpidermal growth factor receptor [T790M,L858R](Homo sapiens (Human))
Neupharma
US Patent
LigandPNGBDBM318899(N-(3-(2-((4-(2-methoxyethoxy)phenyl)amino)quinazol...)
Affinity DataIC50: <100nM. Assay description: The compound of Formula I binds to a kinase selected from the group consisting of EGFR, EGFR L858R, EGFR T790M, EGFR del E746-A750, or EGFR L858R/T79...
Ligand InfoPC cidPC sid
In DepthDetails US Patent
TargetTyrosine-protein kinase BTK(Homo sapiens (Human))
Neupharma
US Patent
LigandPNGBDBM318899(N-(3-(2-((4-(2-methoxyethoxy)phenyl)amino)quinazol...)
Affinity DataIC50: <100nM. Assay description: The compound of Formula I binds to a kinase selected from the group consisting of EGFR, EGFR L858R, EGFR T790M, EGFR del E746-A750, or EGFR L858R/T79...
Ligand InfoPC cidPC sid
In DepthDetails US Patent
TargetEpidermal growth factor receptor(Homo sapiens (Human))
Neupharma
US Patent
LigandPNGBDBM318899(N-(3-(2-((4-(2-methoxyethoxy)phenyl)amino)quinazol...)
Affinity DataIC50: >500nM. Assay description: (i) Peptide/Kinase Mixtures for measurement of EGFR (ErbB1):The 2×EGFR (ErbB1)/Tyr 04 mixture is prepared in 50 mM HEPES pH 7.5, 0.01% BRIJ-35, 10 mM...
Ligand InfoPC cidPC sid
In DepthDetails US Patent
TargetTyrosine-protein kinase BTK(Homo sapiens (Human))
Neupharma
US Patent
LigandPNGBDBM318899(N-(3-(2-((4-(2-methoxyethoxy)phenyl)amino)quinazol...)
Affinity DataIC50: <100nM. Assay description: BTK: The 2×BTK/Tyr 01 mixture is prepared in 50 mM HEPES pH 7.5, 0.01% BRIJ-35, 10 mM MgCl2, 1 mM EGTA. The final 10 μL Kinase Reaction consists...
Ligand InfoPC cidPC sid
In DepthDetails US Patent
TargetTyrosine-protein kinase BTK(Homo sapiens (Human))
Neupharma
US Patent
LigandPNGBDBM318899(N-(3-(2-((4-(2-methoxyethoxy)phenyl)amino)quinazol...)
Affinity DataIC50: <100nM. Assay description: (i) Peptide/Kinase Mixtures for measurement of EGFR (ErbB1):The 2×EGFR (ErbB1)/Tyr 04 mixture is prepared in 50 mM HEPES pH 7.5, 0.01% BRIJ-35, 10 mM...
Ligand InfoPC cidPC sid
In DepthDetails US Patent
TargetEpidermal growth factor receptor(Homo sapiens (Human))
Neupharma
US Patent
LigandPNGBDBM318899(N-(3-(2-((4-(2-methoxyethoxy)phenyl)amino)quinazol...)
Affinity DataIC50: >500nM. Assay description: EGFR: The 2×EGFR (ErbB1)/Tyr 04 mixture is prepared in 50 mM HEPES pH 7.5, 0.01% BRIJ-35, 10 mM MgCl2, 4 mM MnCl2, 1 mM EGTA, 2 mM DTT. The final 10 ...
Ligand InfoPC cidPC sid
In DepthDetails US Patent
TargetEpidermal growth factor receptor [T790M,L858R](Homo sapiens (Human))
Neupharma
US Patent
LigandPNGBDBM318899(N-(3-(2-((4-(2-methoxyethoxy)phenyl)amino)quinazol...)
Affinity DataIC50: <100nM. Assay description: EGFR (T790M)(L858R):The 2×EGFR (ErbB1) T790M L858R/Tyr 04 mixture is prepared in 50 mM HEPES pH 6.5, 0.01% BRIJ-35, 10 mM MgCl2, 1 mM EGTA, 0.02% NaN...
Ligand InfoPC cidPC sid
In DepthDetails US Patent
TargetEpidermal growth factor receptor [T790M,L858R](Homo sapiens (Human))
Neupharma
US Patent
LigandPNGBDBM318899(N-(3-(2-((4-(2-methoxyethoxy)phenyl)amino)quinazol...)
Affinity DataIC50: <100nM. Assay description: (i) Peptide/Kinase Mixtures for measurement of EGFR (ErbB1):The 2×EGFR (ErbB1)/Tyr 04 mixture is prepared in 50 mM HEPES pH 7.5, 0.01% BRIJ-35, 10 mM...
Ligand InfoPC cidPC sid
In DepthDetails US Patent