BDBM318920 2-(1-methyl-6-(2-(2,2,3,3,3-pentafluoropropoxy)phenyl)-1H-indazol-3-ylamino)ethanol::US10173985, Example 12
SMILES Cn1nc(NCCO)c2ccc(cc12)-c1ccccc1OCC(F)(F)C(F)(F)F
InChI Key InChIKey=JXQJGIKOENCQEQ-UHFFFAOYSA-N
Data  2 IC50
  Tab Delimited (TSV)   2D SDfile   Computed 3D by Vconf -m prep SDfile
Find this compound or compounds like it in BindingDB:
Activity Spreadsheet -- Enzyme Inhibition Constant Data from BindingDB
Found 2 hits for monomerid = 318920
TargetSodium channel protein type 5 subunit alpha(Homo sapiens (Human))
Almirall
US Patent
LigandPNGBDBM318920(2-(1-methyl-6-(2-(2,2,3,3,3-pentafluoropropoxy)phe...)
Affinity DataIC50: >3.30E+4nM. Assay description: Electrophysiological studies are performed with an IonWorks Quattro (Molecular Devices Corp.) automated patch-clamp electrophysiology platform as des...
Ligand InfoPC cidPC sid
In DepthDetails US Patent
TargetSodium channel protein type 9 subunit alpha(Homo sapiens (Human))
Almirall
US Patent
LigandPNGBDBM318920(2-(1-methyl-6-(2-(2,2,3,3,3-pentafluoropropoxy)phe...)
Affinity DataIC50:  820nM. Assay description: Electrophysiological studies are performed with an IonWorks Quattro (Molecular Devices Corp.) automated patch-clamp electrophysiology platform as des...
Ligand InfoPC cidPC sid
In DepthDetails US Patent