BDBM319331 N-[(cyclopropyl- carbamoyl) methyl]-2-{5- fluoro-6-[4-(1H- pyrazol-1-yl) phenyl]-1,3- benzothiazol- 2-yl}-2- methanesulfonyl- acetamide::US10173991, Example 375
SMILES CS(=O)(=O)C(C(=O)NCC(=O)NC1CC1)c1nc2cc(F)c(cc2s1)-c1ccc(cc1)-n1cccn1
InChI Key InChIKey=YANLDDHICABKDW-UHFFFAOYSA-N
Data  1 IC50
  Tab Delimited (TSV)   2D SDfile   Computed 3D by Vconf -m prep SDfile
Find this compound or compounds like it in BindingDB:
Activity Spreadsheet -- Enzyme Inhibition Constant Data from BindingDB
Found 1 hit for monomerid = 319331
TargetEndothelial lipase(Homo sapiens (Human))
Bristol-Myers Squibb
US Patent
LigandPNGBDBM319331(N-[(cyclopropyl- carbamoyl) methyl]-2-{5- fluoro-6...)
Affinity DataIC50:  2nM. Assay description: Endothelial lipase (EL) and hepatic lipase (HL) activities were measured using a fluorescent substrate, A10070, (Invitrogen, CA) doped into an artifi...
Ligand InfoPC cidPC sid
In DepthDetails US Patent