BDBM319375 US10173991, Example 423::benzyl N-{4-[2- ({[(cyclopropyl- carbamoyl)methyl] carbamoyl}[2- (morpholin-4-yl) ethanesulfonyl] methyl)-5-fluoro- 1,3-benzothiazol- 6-yl]phenyl} carbamate
SMILES Fc1cc2nc(sc2cc1-c1ccc(NC(=O)OCc2ccccc2)cc1)C(C(=O)NCC(=O)NC1CC1)S(=O)(=O)CCN1CCOCC1
InChI Key InChIKey=ZFUXTCCERKNDRB-UHFFFAOYSA-N
Data  1 IC50
  Tab Delimited (TSV)   2D SDfile   Computed 3D by Vconf -m prep SDfile
Find this compound or compounds like it in BindingDB:
Activity Spreadsheet -- Enzyme Inhibition Constant Data from BindingDB
Found 1 hit for monomerid = 319375
TargetEndothelial lipase(Homo sapiens (Human))
Bristol-Myers Squibb
US Patent
LigandPNGBDBM319375(US10173991, Example 423 | benzyl N-{4-[2- ({[(cycl...)
Affinity DataIC50:  1nM. Assay description: Endothelial lipase (EL) and hepatic lipase (HL) activities were measured using a fluorescent substrate, A10070, (Invitrogen, CA) doped into an artifi...
Ligand InfoPC cidPC sid
In DepthDetails US Patent