BDBM319579 7-methoxy-1-{[(1R,5R)-3-oxo-2-azabicyclo[3.1.0]hex-1-yl]methoxylisoquinoline-6-carboxamide::US10174000, Example 31
SMILES COc1cc2c(OC[C@@]34C[C@@H]3CC(=O)N4)nccc2cc1C(N)=O
InChI Key InChIKey=NVZQDGCTPMTAPF-BTDLBPIBSA-N
Data  2 IC50
  Tab Delimited (TSV)   2D SDfile   Computed 3D by Vconf -m prep SDfile
Find this compound or compounds like it in BindingDB:
Activity Spreadsheet -- Enzyme Inhibition Constant Data from BindingDB
Found 2 hits for monomerid = 319579
TargetInterleukin-1 receptor-associated kinase 4(Homo sapiens (Human))
Pfizer
US Patent
LigandPNGBDBM319579(7-methoxy-1-{[(1R,5R)-3-oxo-2-azabicyclo[3.1.0]hex...)
Affinity DataIC50:  1.20E+3nM. Assay description: This is an in vitro assay to measure IRAK4 enzymatic activity utilizing the DELFIA (Dissociation-Enhanced Lanthanide Fluorescent Immunoassay, Perkin-...
Ligand InfoPC cidPC sid
In DepthDetails US Patent
TargetInterleukin-1 receptor-associated kinase 4(Homo sapiens (Human))
Pfizer
US Patent
LigandPNGBDBM319579(7-methoxy-1-{[(1R,5R)-3-oxo-2-azabicyclo[3.1.0]hex...)
Affinity DataIC50: >1.00E+5nM. Assay description: This is an in vitro assay to measure IRAK4 enzymatic activity utilizing the DELFIA (Dissociation-Enhanced Lanthanide Fluorescent Immunoassay, Perkin-...
Ligand InfoPC cidPC sid
In DepthDetails US Patent