BDBM319599 US20230270730, Compound A-7
SMILES C[N]1=CC2C=CC(COc3ccnn3-c3cc(ccn3)C(O)=O)=CC2=N1
InChI Key InChIKey=FFEXNOSFQCOCPF-UHFFFAOYSA-N
Data  2 IC50
  Tab Delimited (TSV)   2D SDfile   Computed 3D by Vconf -m prep SDfile
Find this compound or compounds like it in BindingDB:
Activity Spreadsheet -- Enzyme Inhibition Constant Data from BindingDB
Found 2 hits for monomerid = 319599
TargetSerine/threonine-protein kinase B-raf(Homo sapiens (Human))
Chugai Seiyaku Kabushiki Kaisha
US Patent
LigandPNGBDBM319599(US20230270730, Compound A-7)
Affinity DataIC50:  5nM. Assay description: The test compound, BRAF (Eurofins Genomics KK.) and MEK1 (Thermo Fisher Scientific Inc.) were mixed in ATP-containing buffer and reacted for 90 minut...
Ligand InfoPC cidPC sid
In DepthDetails US Patent
TargetDual specificity mitogen-activated protein kinase kinase 1(Homo sapiens (Human))
Chugai Seiyaku Kabushiki Kaisha
US Patent
LigandPNGBDBM319599(US20230270730, Compound A-7)
Affinity DataIC50:  18nM. Assay description: The test compound, CRAF (Thermo Fisher Scientific Inc.), MEK1 (Thermo Fisher Scientific Inc.) and ERK2 (Carna Biosciences, Inc.) were mixed in ATP-co...
Ligand InfoPC cidPC sid
In DepthDetails US Patent