BDBM319773 US10174013, Example 1AL
SMILES CCn1c(NCCN)nc2c(c(Br)c(Br)cc12)[N+]([O-])=O
InChI Key InChIKey=INYOGFGRCSKRGD-UHFFFAOYSA-N
Data  1 IC50
  Tab Delimited (TSV)   2D SDfile   Computed 3D by Vconf -m prep SDfile
Find this compound or compounds like it in BindingDB:
Activity Spreadsheet -- Enzyme Inhibition Constant Data from BindingDB
Found 1 hit for monomerid = 319773
TargetPotassium voltage-gated channel subfamily H member 2(Homo sapiens (Human))
Selvita
US Patent
LigandPNGBDBM319773(US10174013, Example 1AL)
Affinity DataIC50:  2.42E+3nM. Assay description: The hERG (human ether-A-go-go-related gene) channel corresponds to an important anti-target for potential new drugs since its inhibition may lead to ...
Ligand InfoPC cidPC sid
In DepthDetails US Patent