BDBM319852 3-(5-Methyl-1,3-thiazol-2-yl)-5-[(3R)-tetrahydrofuran-3-yloxy]-N-{(1R)-1-[6-(trifluoromethyl)pyridazin-3-yl]ethyl}benzamide::US10174016, Example 19::US10202369, Example 19::US10472354, Example 19
SMILES C[C@@H](NC(=O)c1cc(O[C@@H]2CCOC2)cc(c1)-c1ncc(C)s1)c1ccc(nn1)C(F)(F)F
InChI Key InChIKey=DNHMMXLROIMBSA-CZUORRHYSA-N
Data  18 IC50
  Tab Delimited (TSV)   2D SDfile   Computed 3D by Vconf -m prep SDfile
Find this compound or compounds like it in BindingDB:
Activity Spreadsheet -- Enzyme Inhibition Constant Data from BindingDB
Found 18 hits for monomerid = 319852
TargetP2X purinoceptor 3(Homo sapiens (Human))
Bayer Aktiengesellschaft
US Patent
LigandPNGBDBM319852(3-(5-Methyl-1,3-thiazol-2-yl)-5-[(3R)-tetrahydrofu...)
Affinity DataIC50:  19nM. Assay description: A fluorescent imaging plate reader (FLEX/FLIPR station; Molecular Devices) was used to monitor intracellular calcium levels using the calcium-chelati...
Ligand InfoPC cidPC sid
In DepthDetails US Patent
TargetP2X purinoceptor 2/3(Homo sapiens (Human))
Bayer Aktiengesellschaft
US Patent
LigandPNGBDBM319852(3-(5-Methyl-1,3-thiazol-2-yl)-5-[(3R)-tetrahydrofu...)
Affinity DataIC50:  749nM. Assay description: A fluorescent imaging plate reader (FILEX/FLIPR station; Molecular Devices) was used to monitor intracellular calcium levels using the calcium-chelat...
Ligand InfoPC cidPC sid
In DepthDetails US Patent
TargetP2X purinoceptor 3(Homo sapiens (Human))
Bayer Aktiengesellschaft
US Patent
LigandPNGBDBM319852(3-(5-Methyl-1,3-thiazol-2-yl)-5-[(3R)-tetrahydrofu...)
Affinity DataIC50:  19nM. Assay description: A fluorescent imaging plate reader (FLEX/FLIPR station; Molecular Devices) was used to monitor intracellular calcium levels using the calcium-chelati...
Ligand InfoPC cidPC sid
In DepthDetails US Patent
TargetP2X purinoceptor 2(Homo sapiens (Human))
Beyer Aktiengesellschaft
US Patent
LigandPNGBDBM319852(3-(5-Methyl-1,3-thiazol-2-yl)-5-[(3R)-tetrahydrofu...)
Affinity DataIC50:  749nM. Assay description: A fluorescent imaging plate reader (FLEX/FLIPR station; Molecular Devices) was used to monitor intracellular calcium levels using the calcium-chelati...
Ligand InfoPC cidPC sid
In DepthDetails US Patent
TargetCytochrome P450 1A2(Homo sapiens (Human))
Beyer Aktiengesellschaft
US Patent
LigandPNGBDBM319852(3-(5-Methyl-1,3-thiazol-2-yl)-5-[(3R)-tetrahydrofu...)
Affinity DataIC50: >2.00E+4nM. Assay description: Use of in vitro assays to evaluate the inhibition potential of new drug candidates towards CYP-mediated metabolism has been shown to be effective as ...
Ligand InfoPC cidPC sid
In DepthDetails US Patent
TargetCytochrome P450 2C8(Homo sapiens (Human))
Beyer Aktiengesellschaft
US Patent
LigandPNGBDBM319852(3-(5-Methyl-1,3-thiazol-2-yl)-5-[(3R)-tetrahydrofu...)
Affinity DataIC50: >2.00E+4nM. Assay description: Use of in vitro assays to evaluate the inhibition potential of new drug candidates towards CYP-mediated metabolism has been shown to be effective as ...
Ligand InfoPC cidPC sid
In DepthDetails US Patent
TargetCytochrome P450 2C9(Homo sapiens (Human))
Beyer Aktiengesellschaft
US Patent
LigandPNGBDBM319852(3-(5-Methyl-1,3-thiazol-2-yl)-5-[(3R)-tetrahydrofu...)
Affinity DataIC50: >2.00E+4nM. Assay description: Use of in vitro assays to evaluate the inhibition potential of new drug candidates towards CYP-mediated metabolism has been shown to be effective as ...
Ligand InfoPC cidPC sid
In DepthDetails US Patent
TargetCytochrome P450 2D6(Homo sapiens (Human))
Beyer Aktiengesellschaft
US Patent
LigandPNGBDBM319852(3-(5-Methyl-1,3-thiazol-2-yl)-5-[(3R)-tetrahydrofu...)
Affinity DataIC50: >2.00E+4nM. Assay description: Use of in vitro assays to evaluate the inhibition potential of new drug candidates towards CYP-mediated metabolism has been shown to be effective as ...
Ligand InfoPC cidPC sid
In DepthDetails US Patent
TargetCytochrome P450 3A4(Homo sapiens (Human))
Beyer Aktiengesellschaft
US Patent
LigandPNGBDBM319852(3-(5-Methyl-1,3-thiazol-2-yl)-5-[(3R)-tetrahydrofu...)
Affinity DataIC50: >2.00E+4nM. Assay description: Use of in vitro assays to evaluate the inhibition potential of new drug candidates towards CYP-mediated metabolism has been shown to be effective as ...
Ligand InfoPC cidPC sid
In DepthDetails US Patent
TargetP2X purinoceptor 3(Homo sapiens (Human))
Bayer Aktiengesellschaft
US Patent
LigandPNGBDBM319852(3-(5-Methyl-1,3-thiazol-2-yl)-5-[(3R)-tetrahydrofu...)
Affinity DataIC50:  19nM. Assay description: A fluorescent imaging plate reader (FLEX/FLIPR station; Molecular Devices) was used to monitor intracellular calcium levels using the calcium-chelati...
Ligand InfoPC cidPC sid
In DepthDetails US Patent
TargetP2X purinoceptor 2/3(Homo sapiens (Human))
Bayer Aktiengesellschaft
US Patent
LigandPNGBDBM319852(3-(5-Methyl-1,3-thiazol-2-yl)-5-[(3R)-tetrahydrofu...)
Affinity DataIC50:  749nM. Assay description: A fluorescent imaging plate reader (FLEX/FLIPR station; Molecular Devices) was used to monitor intracellular calcium levels using the calcium-chelati...
Ligand InfoPC cidPC sid
In DepthDetails US Patent
TargetCytochrome P450 1A2(Homo sapiens (Human))
Beyer Aktiengesellschaft
US Patent
LigandPNGBDBM319852(3-(5-Methyl-1,3-thiazol-2-yl)-5-[(3R)-tetrahydrofu...)
Affinity DataIC50: >2.00E+4nM. Assay description: Human liver microsomes (pooled, >30 male and female donors) were incubated with individual CYP isoform-selective standard probes (phenacetin for CYP1...
Ligand InfoPC cidPC sid
In DepthDetails US Patent
TargetCytochrome P450 2C8(Homo sapiens (Human))
Beyer Aktiengesellschaft
US Patent
LigandPNGBDBM319852(3-(5-Methyl-1,3-thiazol-2-yl)-5-[(3R)-tetrahydrofu...)
Affinity DataIC50: >2.00E+4nM. Assay description: Human liver microsomes (pooled, >30 male and female donors) were incubated with individual CYP isoform-selective standard probes (phenacetin for CYP1...
Ligand InfoPC cidPC sid
In DepthDetails US Patent
TargetCytochrome P450 2C9(Homo sapiens (Human))
Beyer Aktiengesellschaft
US Patent
LigandPNGBDBM319852(3-(5-Methyl-1,3-thiazol-2-yl)-5-[(3R)-tetrahydrofu...)
Affinity DataIC50: >2.00E+4nM. Assay description: Human liver microsomes (pooled, >30 male and female donors) were incubated with individual CYP isoform-selective standard probes (phenacetin for CYP1...
Ligand InfoPC cidPC sid
In DepthDetails US Patent
TargetCytochrome P450 2D6(Homo sapiens (Human))
Beyer Aktiengesellschaft
US Patent
LigandPNGBDBM319852(3-(5-Methyl-1,3-thiazol-2-yl)-5-[(3R)-tetrahydrofu...)
Affinity DataIC50: >2.00E+4nM. Assay description: Human liver microsomes (pooled, >30 male and female donors) were incubated with individual CYP isoform-selective standard probes (phenacetin for CYP1...
Ligand InfoPC cidPC sid
In DepthDetails US Patent
TargetCytochrome P450 3A4(Homo sapiens (Human))
Beyer Aktiengesellschaft
US Patent
LigandPNGBDBM319852(3-(5-Methyl-1,3-thiazol-2-yl)-5-[(3R)-tetrahydrofu...)
Affinity DataIC50: >2.00E+4nM. Assay description: Human liver microsomes (pooled, >30 male and female donors) were incubated with individual CYP isoform-selective standard probes (phenacetin for CYP1...
Ligand InfoPC cidPC sid
In DepthDetails US Patent
TargetP2X purinoceptor 3(Homo sapiens (Human))
Bayer Aktiengesellschaft
US Patent
LigandPNGBDBM319852(3-(5-Methyl-1,3-thiazol-2-yl)-5-[(3R)-tetrahydrofu...)
Affinity DataIC50:  19nM. Assay description: A fluorescent imaging plate reader (FILEX/FLIPR station; Molecular Devices) was used to monitor intracellular calcium levels using the calcium-chelat...
Ligand InfoPC cidPC sid
In DepthDetails US Patent
TargetP2X purinoceptor 2(Homo sapiens (Human))
Beyer Aktiengesellschaft
US Patent
LigandPNGBDBM319852(3-(5-Methyl-1,3-thiazol-2-yl)-5-[(3R)-tetrahydrofu...)
Affinity DataIC50:  749nM. Assay description: A fluorescent imaging plate reader (FLEX/FLIPR station; Molecular Devices) was used to monitor intracellular calcium levels using the calcium-chelati...
Ligand InfoPC cidPC sid
In DepthDetails US Patent