BDBM319896 3-(5-Methyl-1,3-thiazol-2-yl)-5-[(2R)-tetrahydrofuran-2-ylmethoxy]-N-{(1R)-1-[2-(trifluoromethyl)pyrimidin-5-yl]ethyl}benzamide::US10174016, Example 63::US10202369, Example 63::US10472354, Example 63
SMILES C[C@@H](NC(=O)c1cc(OC[C@H]2CCCO2)cc(c1)-c1ncc(C)s1)c1cnc(nc1)C(F)(F)F
InChI Key InChIKey=MXZPUDRHAAYJOR-RDTXWAMCSA-N
Data  8 IC50
  Tab Delimited (TSV)   2D SDfile   Computed 3D by Vconf -m prep SDfile
Find this compound or compounds like it in BindingDB:
Activity Spreadsheet -- Enzyme Inhibition Constant Data from BindingDB
Found 8 hits for monomerid = 319896
TargetP2X purinoceptor 3(Homo sapiens (Human))
Bayer Aktiengesellschaft
US Patent
LigandPNGBDBM319896(3-(5-Methyl-1,3-thiazol-2-yl)-5-[(2R)-tetrahydrofu...)
Affinity DataIC50:  4nM. Assay description: A fluorescent imaging plate reader (FLEX/FLIPR station; Molecular Devices) was used to monitor intracellular calcium levels using the calcium-chelati...
Ligand InfoPC cidPC sid
In DepthDetails US Patent
TargetP2X purinoceptor 2(Homo sapiens (Human))
Bayer Aktiengesellschaft
US Patent
LigandPNGBDBM319896(3-(5-Methyl-1,3-thiazol-2-yl)-5-[(2R)-tetrahydrofu...)
Affinity DataIC50:  118nM. Assay description: A fluorescent imaging plate reader (FLEX/FLIPR station; Molecular Devices) was used to monitor intracellular calcium levels using the calcium-chelati...
Ligand InfoPC cidPC sid
In DepthDetails US Patent
TargetP2X purinoceptor 3(Homo sapiens (Human))
Bayer Aktiengesellschaft
US Patent
LigandPNGBDBM319896(3-(5-Methyl-1,3-thiazol-2-yl)-5-[(2R)-tetrahydrofu...)
Affinity DataIC50:  4nM. Assay description: A fluorescent imaging plate reader (FLEX/FLIPR station; Molecular Devices) was used to monitor intracellular calcium levels using the calcium-chelati...
Ligand InfoPC cidPC sid
In DepthDetails US Patent
TargetP2X purinoceptor 2/3(Homo sapiens (Human))
Bayer Aktiengesellschaft
US Patent
LigandPNGBDBM319896(3-(5-Methyl-1,3-thiazol-2-yl)-5-[(2R)-tetrahydrofu...)
Affinity DataIC50:  118nM. Assay description: A fluorescent imaging plate reader (FILEX/FLIPR station; Molecular Devices) was used to monitor intracellular calcium levels using the calcium-chelat...
Ligand InfoPC cidPC sid
In DepthDetails US Patent
TargetP2X purinoceptor 3(Homo sapiens (Human))
Bayer Aktiengesellschaft
US Patent
LigandPNGBDBM319896(3-(5-Methyl-1,3-thiazol-2-yl)-5-[(2R)-tetrahydrofu...)
Affinity DataIC50:  4nM. Assay description: A fluorescent imaging plate reader (FLEX/FLIPR station; Molecular Devices) was used to monitor intracellular calcium levels using the calcium-chelati...
Ligand InfoPC cidPC sid
In DepthDetails US Patent
TargetP2X purinoceptor 2/3(Homo sapiens (Human))
Bayer Aktiengesellschaft
US Patent
LigandPNGBDBM319896(3-(5-Methyl-1,3-thiazol-2-yl)-5-[(2R)-tetrahydrofu...)
Affinity DataIC50:  118nM. Assay description: A fluorescent imaging plate reader (FLEX/FLIPR station; Molecular Devices) was used to monitor intracellular calcium levels using the calcium-chelati...
Ligand InfoPC cidPC sid
In DepthDetails US Patent
TargetP2X purinoceptor 3(Homo sapiens (Human))
Bayer Aktiengesellschaft
US Patent
LigandPNGBDBM319896(3-(5-Methyl-1,3-thiazol-2-yl)-5-[(2R)-tetrahydrofu...)
Affinity DataIC50:  4nM. Assay description: A fluorescent imaging plate reader (FILEX/FLIPR station; Molecular Devices) was used to monitor intracellular calcium levels using the calcium-chelat...
Ligand InfoPC cidPC sid
In DepthDetails US Patent
TargetP2X purinoceptor 2(Homo sapiens (Human))
Bayer Aktiengesellschaft
US Patent
LigandPNGBDBM319896(3-(5-Methyl-1,3-thiazol-2-yl)-5-[(2R)-tetrahydrofu...)
Affinity DataIC50:  118nM. Assay description: A fluorescent imaging plate reader (FLEX/FLIPR station; Molecular Devices) was used to monitor intracellular calcium levels using the calcium-chelati...
Ligand InfoPC cidPC sid
In DepthDetails US Patent