BDBM319935 N-[(1R)-1-(5- Methylpyrazin- 2-yl)ethyl]- 3-[(2- methylpyridin- 4-yl)oxy]-5- (5-methyl- 1,3-thiazol-2- yl)benzamide::US10174016, Example 102::US10202369, Example 102::US10472354, Example 102
SMILES C[C@@H](NC(=O)c1cc(Oc2ccnc(C)c2)cc(c1)-c1ncc(C)s1)c1cnc(C)cn1
InChI Key InChIKey=QEKNBUCJINMCOL-QGZVFWFLSA-N
Data  8 IC50
  Tab Delimited (TSV)   2D SDfile   Computed 3D by Vconf -m prep SDfile
Find this compound or compounds like it in BindingDB:
Activity Spreadsheet -- Enzyme Inhibition Constant Data from BindingDB
Found 8 hits for monomerid = 319935
TargetP2X purinoceptor 3(Homo sapiens (Human))
Bayer Aktiengesellschaft
US Patent
LigandPNGBDBM319935(N-[(1R)-1-(5- Methylpyrazin- 2-yl)ethyl]- 3-[(2- m...)
Affinity DataIC50:  10nM. Assay description: A fluorescent imaging plate reader (FLEX/FLIPR station; Molecular Devices) was used to monitor intracellular calcium levels using the calcium-chelati...
Ligand InfoPC cidPC sid
In DepthDetails US Patent
TargetP2X purinoceptor 2(Homo sapiens (Human))
Bayer Aktiengesellschaft
US Patent
LigandPNGBDBM319935(N-[(1R)-1-(5- Methylpyrazin- 2-yl)ethyl]- 3-[(2- m...)
Affinity DataIC50:  57nM. Assay description: A fluorescent imaging plate reader (FLEX/FLIPR station; Molecular Devices) was used to monitor intracellular calcium levels using the calcium-chelati...
Ligand InfoPC cidPC sid
In DepthDetails US Patent
TargetP2X purinoceptor 3(Homo sapiens (Human))
Bayer Aktiengesellschaft
US Patent
LigandPNGBDBM319935(N-[(1R)-1-(5- Methylpyrazin- 2-yl)ethyl]- 3-[(2- m...)
Affinity DataIC50:  10nM. Assay description: A fluorescent imaging plate reader (FLEX/FLIPR station; Molecular Devices) was used to monitor intracellular calcium levels using the calcium-chelati...
Ligand InfoPC cidPC sid
In DepthDetails US Patent
TargetP2X purinoceptor 2/3(Homo sapiens (Human))
Bayer Aktiengesellschaft
US Patent
LigandPNGBDBM319935(N-[(1R)-1-(5- Methylpyrazin- 2-yl)ethyl]- 3-[(2- m...)
Affinity DataIC50:  57nM. Assay description: A fluorescent imaging plate reader (FILEX/FLIPR station; Molecular Devices) was used to monitor intracellular calcium levels using the calcium-chelat...
Ligand InfoPC cidPC sid
In DepthDetails US Patent
TargetP2X purinoceptor 3(Homo sapiens (Human))
Bayer Aktiengesellschaft
US Patent
LigandPNGBDBM319935(N-[(1R)-1-(5- Methylpyrazin- 2-yl)ethyl]- 3-[(2- m...)
Affinity DataIC50:  10nM. Assay description: A fluorescent imaging plate reader (FLEX/FLIPR station; Molecular Devices) was used to monitor intracellular calcium levels using the calcium-chelati...
Ligand InfoPC cidPC sid
In DepthDetails US Patent
TargetP2X purinoceptor 2/3(Homo sapiens (Human))
Bayer Aktiengesellschaft
US Patent
LigandPNGBDBM319935(N-[(1R)-1-(5- Methylpyrazin- 2-yl)ethyl]- 3-[(2- m...)
Affinity DataIC50:  57nM. Assay description: A fluorescent imaging plate reader (FLEX/FLIPR station; Molecular Devices) was used to monitor intracellular calcium levels using the calcium-chelati...
Ligand InfoPC cidPC sid
In DepthDetails US Patent
TargetP2X purinoceptor 3(Homo sapiens (Human))
Bayer Aktiengesellschaft
US Patent
LigandPNGBDBM319935(N-[(1R)-1-(5- Methylpyrazin- 2-yl)ethyl]- 3-[(2- m...)
Affinity DataIC50:  10nM. Assay description: A fluorescent imaging plate reader (FILEX/FLIPR station; Molecular Devices) was used to monitor intracellular calcium levels using the calcium-chelat...
Ligand InfoPC cidPC sid
In DepthDetails US Patent
TargetP2X purinoceptor 2(Homo sapiens (Human))
Bayer Aktiengesellschaft
US Patent
LigandPNGBDBM319935(N-[(1R)-1-(5- Methylpyrazin- 2-yl)ethyl]- 3-[(2- m...)
Affinity DataIC50:  57nM. Assay description: A fluorescent imaging plate reader (FLEX/FLIPR station; Molecular Devices) was used to monitor intracellular calcium levels using the calcium-chelati...
Ligand InfoPC cidPC sid
In DepthDetails US Patent