BDBM320227 3-(Azetidin-3-ylmethoxy)-5-(5-methyl-1,3-thiazol-2-yl)-N-{(1R)-1-[2-(trifluoromethyl)pyrimidin-5-yl]ethyl}benzamide::US10174016, Example 394::US10202369, Example 394::US10472354, Example 394
SMILES C[C@@H](NC(=O)c1cc(OCC2CNC2)cc(c1)-c1ncc(C)s1)c1cnc(nc1)C(F)(F)F
InChI Key InChIKey=MHYFOJHMKOGSKR-CYBMUJFWSA-N
Data  8 IC50
  Tab Delimited (TSV)   2D SDfile   Computed 3D by Vconf -m prep SDfile
Find this compound or compounds like it in BindingDB:
Activity Spreadsheet -- Enzyme Inhibition Constant Data from BindingDB
Found 8 hits for monomerid = 320227
TargetP2X purinoceptor 3(Homo sapiens (Human))
Bayer Aktiengesellschaft
US Patent
LigandPNGBDBM320227(3-(Azetidin-3-ylmethoxy)-5-(5-methyl-1,3-thiazol-2...)
Affinity DataIC50:  82nM. Assay description: A fluorescent imaging plate reader (FLEX/FLIPR station; Molecular Devices) was used to monitor intracellular calcium levels using the calcium-chelati...
Ligand InfoPC cidPC sid
In DepthDetails US Patent
TargetP2X purinoceptor 2(Homo sapiens (Human))
Bayer Aktiengesellschaft
US Patent
LigandPNGBDBM320227(3-(Azetidin-3-ylmethoxy)-5-(5-methyl-1,3-thiazol-2...)
Affinity DataIC50:  3.98E+3nM. Assay description: A fluorescent imaging plate reader (FLEX/FLIPR station; Molecular Devices) was used to monitor intracellular calcium levels using the calcium-chelati...
Ligand InfoPC cidPC sid
In DepthDetails US Patent
TargetP2X purinoceptor 3(Homo sapiens (Human))
Bayer Aktiengesellschaft
US Patent
LigandPNGBDBM320227(3-(Azetidin-3-ylmethoxy)-5-(5-methyl-1,3-thiazol-2...)
Affinity DataIC50:  82nM. Assay description: A fluorescent imaging plate reader (FLEX/FLIPR station; Molecular Devices) was used to monitor intracellular calcium levels using the calcium-chelati...
Ligand InfoPC cidPC sid
In DepthDetails US Patent
TargetP2X purinoceptor 2/3(Homo sapiens (Human))
Bayer Aktiengesellschaft
US Patent
LigandPNGBDBM320227(3-(Azetidin-3-ylmethoxy)-5-(5-methyl-1,3-thiazol-2...)
Affinity DataIC50:  3.98E+3nM. Assay description: A fluorescent imaging plate reader (FILEX/FLIPR station; Molecular Devices) was used to monitor intracellular calcium levels using the calcium-chelat...
Ligand InfoPC cidPC sid
In DepthDetails US Patent
TargetP2X purinoceptor 3(Homo sapiens (Human))
Bayer Aktiengesellschaft
US Patent
LigandPNGBDBM320227(3-(Azetidin-3-ylmethoxy)-5-(5-methyl-1,3-thiazol-2...)
Affinity DataIC50:  82nM. Assay description: A fluorescent imaging plate reader (FLEX/FLIPR station; Molecular Devices) was used to monitor intracellular calcium levels using the calcium-chelati...
Ligand InfoPC cidPC sid
In DepthDetails US Patent
TargetP2X purinoceptor 2/3(Homo sapiens (Human))
Bayer Aktiengesellschaft
US Patent
LigandPNGBDBM320227(3-(Azetidin-3-ylmethoxy)-5-(5-methyl-1,3-thiazol-2...)
Affinity DataIC50:  3.98E+3nM. Assay description: A fluorescent imaging plate reader (FLEX/FLIPR station; Molecular Devices) was used to monitor intracellular calcium levels using the calcium-chelati...
Ligand InfoPC cidPC sid
In DepthDetails US Patent
TargetP2X purinoceptor 3(Homo sapiens (Human))
Bayer Aktiengesellschaft
US Patent
LigandPNGBDBM320227(3-(Azetidin-3-ylmethoxy)-5-(5-methyl-1,3-thiazol-2...)
Affinity DataIC50:  82nM. Assay description: A fluorescent imaging plate reader (FILEX/FLIPR station; Molecular Devices) was used to monitor intracellular calcium levels using the calcium-chelat...
Ligand InfoPC cidPC sid
In DepthDetails US Patent
TargetP2X purinoceptor 2(Homo sapiens (Human))
Bayer Aktiengesellschaft
US Patent
LigandPNGBDBM320227(3-(Azetidin-3-ylmethoxy)-5-(5-methyl-1,3-thiazol-2...)
Affinity DataIC50:  3.98E+3nM. Assay description: A fluorescent imaging plate reader (FLEX/FLIPR station; Molecular Devices) was used to monitor intracellular calcium levels using the calcium-chelati...
Ligand InfoPC cidPC sid
In DepthDetails US Patent