BDBM320229 3-(5-methyl-1,3- thiazol-2-yl)-5- {[(3R)-5- oxomorpholin-3- yl]methoxy}-N- {(1R)-1-[2- (trifluoromethyl) pyrimidin-5-yl] ethyl}benzamide::US10174016, Example 396::US10202369, Example 396::US10472354, Example 396
SMILES C[C@@H](NC(=O)c1cc(OC[C@H]2COCC(=O)N2)cc(c1)-c1ncc(C)s1)c1cnc(nc1)C(F)(F)F
InChI Key InChIKey=QBCIMXIDQXCQLC-CXAGYDPISA-N
Data  8 IC50
  Tab Delimited (TSV)   2D SDfile   Computed 3D by Vconf -m prep SDfile
Find this compound or compounds like it in BindingDB:
Activity Spreadsheet -- Enzyme Inhibition Constant Data from BindingDB
Found 8 hits for monomerid = 320229
TargetP2X purinoceptor 3(Homo sapiens (Human))
Bayer Aktiengesellschaft
US Patent
LigandPNGBDBM320229(3-(5-methyl-1,3- thiazol-2-yl)-5- {[(3R)-5- oxomor...)
Affinity DataIC50:  22nM. Assay description: A fluorescent imaging plate reader (FLEX/FLIPR station; Molecular Devices) was used to monitor intracellular calcium levels using the calcium-chelati...
Ligand InfoPC cidPC sid
In DepthDetails US Patent
TargetP2X purinoceptor 2(Homo sapiens (Human))
Bayer Aktiengesellschaft
US Patent
LigandPNGBDBM320229(3-(5-methyl-1,3- thiazol-2-yl)-5- {[(3R)-5- oxomor...)
Affinity DataIC50:  1.80E+3nM. Assay description: A fluorescent imaging plate reader (FLEX/FLIPR station; Molecular Devices) was used to monitor intracellular calcium levels using the calcium-chelati...
Ligand InfoPC cidPC sid
In DepthDetails US Patent
TargetP2X purinoceptor 3(Homo sapiens (Human))
Bayer Aktiengesellschaft
US Patent
LigandPNGBDBM320229(3-(5-methyl-1,3- thiazol-2-yl)-5- {[(3R)-5- oxomor...)
Affinity DataIC50:  22nM. Assay description: A fluorescent imaging plate reader (FLEX/FLIPR station; Molecular Devices) was used to monitor intracellular calcium levels using the calcium-chelati...
Ligand InfoPC cidPC sid
In DepthDetails US Patent
TargetP2X purinoceptor 2/3(Homo sapiens (Human))
Bayer Aktiengesellschaft
US Patent
LigandPNGBDBM320229(3-(5-methyl-1,3- thiazol-2-yl)-5- {[(3R)-5- oxomor...)
Affinity DataIC50:  1.80E+3nM. Assay description: A fluorescent imaging plate reader (FILEX/FLIPR station; Molecular Devices) was used to monitor intracellular calcium levels using the calcium-chelat...
Ligand InfoPC cidPC sid
In DepthDetails US Patent
TargetP2X purinoceptor 3(Homo sapiens (Human))
Bayer Aktiengesellschaft
US Patent
LigandPNGBDBM320229(3-(5-methyl-1,3- thiazol-2-yl)-5- {[(3R)-5- oxomor...)
Affinity DataIC50:  22nM. Assay description: A fluorescent imaging plate reader (FLEX/FLIPR station; Molecular Devices) was used to monitor intracellular calcium levels using the calcium-chelati...
Ligand InfoPC cidPC sid
In DepthDetails US Patent
TargetP2X purinoceptor 2/3(Homo sapiens (Human))
Bayer Aktiengesellschaft
US Patent
LigandPNGBDBM320229(3-(5-methyl-1,3- thiazol-2-yl)-5- {[(3R)-5- oxomor...)
Affinity DataIC50:  1.80E+3nM. Assay description: A fluorescent imaging plate reader (FLEX/FLIPR station; Molecular Devices) was used to monitor intracellular calcium levels using the calcium-chelati...
Ligand InfoPC cidPC sid
In DepthDetails US Patent
TargetP2X purinoceptor 3(Homo sapiens (Human))
Bayer Aktiengesellschaft
US Patent
LigandPNGBDBM320229(3-(5-methyl-1,3- thiazol-2-yl)-5- {[(3R)-5- oxomor...)
Affinity DataIC50:  22nM. Assay description: A fluorescent imaging plate reader (FILEX/FLIPR station; Molecular Devices) was used to monitor intracellular calcium levels using the calcium-chelat...
Ligand InfoPC cidPC sid
In DepthDetails US Patent
TargetP2X purinoceptor 2(Homo sapiens (Human))
Bayer Aktiengesellschaft
US Patent
LigandPNGBDBM320229(3-(5-methyl-1,3- thiazol-2-yl)-5- {[(3R)-5- oxomor...)
Affinity DataIC50:  1.80E+3nM. Assay description: A fluorescent imaging plate reader (FLEX/FLIPR station; Molecular Devices) was used to monitor intracellular calcium levels using the calcium-chelati...
Ligand InfoPC cidPC sid
In DepthDetails US Patent