BDBM320254 N-(4-carboxyphenyl)-7-(5-chloro-2-(H-tetrazol-1-yl)phenyl)-5-oxo-1,2,3,5-tetrahydroindolizine-3-carboxamide ::US10174020, Compound 2
SMILES OC(=O)c1ccc(NC(=O)C2CCc3cc(cc(=O)n23)-c2cc(Cl)ccc2-n2cnnn2)cc1
InChI Key InChIKey=AHWRCBABECLIDB-UHFFFAOYSA-N
Data  1 KI
  Tab Delimited (TSV)   2D SDfile   Computed 3D by Vconf -m prep SDfile
Find this compound or compounds like it in BindingDB:
Activity Spreadsheet -- Enzyme Inhibition Constant Data from BindingDB
Found 1 hit for monomerid = 320254
TargetCoagulation factor XI(Homo sapiens (Human))
Sichuan Haisco Pharmaceutical
US Patent
LigandPNGBDBM320254(N-(4-carboxyphenyl)-7-(5-chloro-2-(H-tetrazol-1-yl...)
Affinity DataKi:  68nM. Assay description: The following method was used to test the in vitro inhibitory effect of the compounds of the present invention on the activity of human blood-coagula...
Ligand InfoPC cidPC sid
In DepthDetails US Patent