BDBM320262 5-[[2-[4-[5-chloro-2-(tetrazol-1-yl)phenyl]-2-oxo-1-pyridyl]-3-phenyl-propanoyl]amino]-1H-indole-2-carboxylic Acid ::US10174020, Compound 9
SMILES OC(=O)c1cc2cc(NC(=O)C(Cc3ccccc3)n3ccc(cc3=O)-c3cc(Cl)ccc3-n3cnnn3)ccc2[nH]1
InChI Key
Data  1 KI
  Tab Delimited (TSV)   2D SDfile   Computed 3D by Vconf -m prep SDfile
Find this compound or compounds like it in BindingDB:
Activity Spreadsheet -- Enzyme Inhibition Constant Data from BindingDB
Found 1 hit for monomerid = 320262
TargetCoagulation factor XI(Homo sapiens (Human))
Sichuan Haisco Pharmaceutical
US Patent
LigandPNGBDBM320262(5-[[2-[4-[5-chloro-2-(tetrazol-1-yl)phenyl]-2-oxo-...)
Affinity DataKi:  4nM. Assay description: The following method was used to test the in vitro inhibitory effect of the compounds of the present invention on the activity of human blood-coagula...
Ligand InfoPC cidPC sid
In DepthDetails US Patent