BDBM320312 4-(2H3)Methoxy-5-{7-[4-(2H)methoxy-1-methyl-1H-1,2,3-triazol-5-yl]-5-[(S)-oxan-4-yl-(phenyl)methyl]-5H-pyrido[3,2-b]indol-3-yl}-1-methyl-1H-1,2,3-triazole::BDBM320313::US10174024, Example 29
SMILES COc1nnn(C)c1-c1ccc2c(c1)n([C@@H](C1CCOCC1)c1ccccc1)c1cc(cnc21)-c1c(OC)nnn1C
InChI Key InChIKey=UQWOIUCJNKEQBG-HHHXNRCGSA-N
Data  3 IC50
  Tab Delimited (TSV)   2D SDfile   Computed 3D by Vconf -m prep SDfile
Find this compound or compounds like it in BindingDB:
Activity Spreadsheet -- Enzyme Inhibition Constant Data from BindingDB
Found 3 hits for monomerid = 320312
TargetBromodomain-containing protein 4(Homo sapiens (Human))
Bristol-Myers Squibb
US Patent
LigandPNGBDBM320312(4-(2H3)Methoxy-5-{7-[4-(2H)methoxy-1-methyl-1H-1,2...)
Affinity DataIC50: <5nM. Assay description: The binding of compounds to bromodomain BRD4 (44-168), BRD4 (333-460), and BRD4 (1-477 or 44-460) was assessed using a time resolved fluorescent reso...
Ligand InfoPC cidPC sid
In DepthDetails US Patent
TargetBromodomain-containing protein 4(Homo sapiens (Human))
Bristol-Myers Squibb
US Patent
LigandPNGBDBM320312(4-(2H3)Methoxy-5-{7-[4-(2H)methoxy-1-methyl-1H-1,2...)
Affinity DataIC50: <1nM. Assay description: The binding of compounds to bromodomain BRD4 (44-168), BRD4 (333-460), and BRD4 (1-477 or 44-460) was assessed using a time resolved fluorescent reso...
Ligand InfoPC cidPC sid
In DepthDetails US Patent
TargetBromodomain-containing protein 4(Homo sapiens (Human))
Bristol-Myers Squibb
US Patent
LigandPNGBDBM320312(4-(2H3)Methoxy-5-{7-[4-(2H)methoxy-1-methyl-1H-1,2...)
Affinity DataIC50: <5nM. Assay description: The binding of compounds to bromodomain BRD4 (44-168), BRD4 (333-460), and BRD4 (1-477 or 44-460) was assessed using a time resolved fluorescent reso...
Ligand InfoPC cidPC sid
In DepthDetails US Patent