BDBM320332 4-[3-(Dimethyl-1H-1,2,3-triazol-5-yl)-5-[(S)-oxan-4-yl(phenyl)methyl]-5H-pyrido[3,2-b]indol-7-yl]-N,N-dimethylpiperazine-1-sulfonamide::US10174024, Example 50
SMILES CN(C)S(=O)(=O)N1CCN(CC1)c1ccc2c(c1)n([C@@H](C1CCOCC1)c1ccccc1)c1cc(cnc21)-c1c(C)nnn1C
InChI Key InChIKey=IIOBUIHDKQQVBZ-MGBGTMOVSA-N
Data  1 IC50
  Tab Delimited (TSV)   2D SDfile   Computed 3D by Vconf -m prep SDfile
Find this compound or compounds like it in BindingDB:
Activity Spreadsheet -- Enzyme Inhibition Constant Data from BindingDB
Found 1 hit for monomerid = 320332
TargetBromodomain-containing protein 4(Homo sapiens (Human))
Bristol-Myers Squibb
US Patent
LigandPNGBDBM320332(4-[3-(Dimethyl-1H-1,2,3-triazol-5-yl)-5-[(S)-oxan-...)
Affinity DataIC50: <5nM. Assay description: The binding of compounds to bromodomain BRD4 (44-168), BRD4 (333-460), and BRD4 (1-477 or 44-460) was assessed using a time resolved fluorescent reso...
Ligand InfoPC cidPC sid
In DepthDetails US Patent