BDBM320347 2-{[7-(4,4-Difluoropiperidin-1-yl)-3-[4-(2H3)methyl-1-methyl-1H-1,2,3-triazol-5-yl]-5H-pyrido[3,2-b]indol-5-yl](oxan-4-yl)methyl}-3-fluoropyridine::US10174024, Example 65::US10174024, Example 66
SMILES Cc1n[nH]n(C)c1-c1cnc2c(c1)n(C(C1CCOCC1)c1ncccc1F)c1cc(ccc21)N1CCC(F)(F)CC1
InChI Key InChIKey=WBXXXAKXPHKBOW-UHFFFAOYSA-N
Data  2 IC50
  Tab Delimited (TSV)   2D SDfile   Computed 3D by Vconf -m prep SDfile
Find this compound or compounds like it in BindingDB:
Activity Spreadsheet -- Enzyme Inhibition Constant Data from BindingDB
Found 2 hits for monomerid = 320347
TargetBromodomain-containing protein 4(Homo sapiens (Human))
Bristol-Myers Squibb
US Patent
LigandPNGBDBM320347(2-{[7-(4,4-Difluoropiperidin-1-yl)-3-[4-(2H3)methy...)
Affinity DataIC50: <5nM. Assay description: The binding of compounds to bromodomain BRD4 (44-168), BRD4 (333-460), and BRD4 (1-477 or 44-460) was assessed using a time resolved fluorescent reso...
Ligand InfoPC cidPC sid
In DepthDetails US Patent
TargetBromodomain-containing protein 4(Homo sapiens (Human))
Bristol-Myers Squibb
US Patent
LigandPNGBDBM320347(2-{[7-(4,4-Difluoropiperidin-1-yl)-3-[4-(2H3)methy...)
Affinity DataIC50: <1nM. Assay description: The binding of compounds to bromodomain BRD4 (44-168), BRD4 (333-460), and BRD4 (1-477 or 44-460) was assessed using a time resolved fluorescent reso...
Ligand InfoPC cidPC sid
In DepthDetails US Patent