BDBM320399 2-(cyclopentylmethyl)-1H- pyrrolo[3,2-b]pyridine- 7-carboxylic acid::US10174026, Example 52::US9738637, Example 52
SMILES OC(=O)c1ccnc2cc(CC3CCCC3)[nH]c12
InChI Key InChIKey=OZJOKUHQQZYMME-UHFFFAOYSA-N
Data  3 IC50
  Tab Delimited (TSV)   2D SDfile   Computed 3D by Vconf -m prep SDfile
Find this compound or compounds like it in BindingDB:
Activity Spreadsheet -- Enzyme Inhibition Constant Data from BindingDB
Found 3 hits for monomerid = 320399
TargetLysine-specific demethylase 5A(Homo sapiens (Human))
Celgene Quantical Research
US Patent
LigandPNGBDBM320399(2-(cyclopentylmethyl)-1H- pyrrolo[3,2-b]pyridine- ...)
Affinity DataIC50: <100nM. Assay description: The enzymatic assay of Jarid1A activity is based upon Time Resolved-Fluorescence Resonance Energy Transfer (TR-FRET) detection. The ability of test c...
Ligand InfoPC cidPC sid
In DepthDetails US Patent
TargetLysine-specific demethylase 4C(Homo sapiens (Human))
Celgene Quantical Research
US Patent
LigandPNGBDBM320399(2-(cyclopentylmethyl)-1H- pyrrolo[3,2-b]pyridine- ...)
Affinity DataIC50: <100nM. Assay description: The ability of test compounds to inhibit the activity of JMJD2C was determined in 384-well plate format under the following reaction conditions: 0.3 ...
Ligand InfoPC cidPC sid
In DepthDetails US Patent
TargetLysine-specific demethylase 5B(Homo sapiens (Human))
Celgene Quantical Research
US Patent
LigandPNGBDBM320399(2-(cyclopentylmethyl)-1H- pyrrolo[3,2-b]pyridine- ...)
Affinity DataIC50:  550nM. Assay description: The ability of test compounds to inhibit the activity of Jarid1B was determined in 384-well plate format under the following reaction conditions: 0.8...
Ligand InfoPC cidPC sid
In DepthDetails US Patent