BDBM320540 US10174027, Example 87
SMILES Cn1cc(cn1)-c1cc(-c2ccc(nc2)N2CCN(CC2)S(=O)(=O)CC2CC2)c2c(cnn2c1)C#N
InChI Key InChIKey=HQRTYRXWLUAQPU-UHFFFAOYSA-N
Data  2 IC50
  Tab Delimited (TSV)   2D SDfile   Computed 3D by Vconf -m prep SDfile
Find this compound or compounds like it in BindingDB:
Activity Spreadsheet -- Enzyme Inhibition Constant Data from BindingDB
Found 2 hits for monomerid = 320540
TargetProto-oncogene tyrosine-protein kinase receptor Ret(Homo sapiens (Human))
Array Biopharma
US Patent
LigandPNGBDBM320540(US10174027, Example 87)
Affinity DataIC50:  5.30nM. Assay description: Compounds of General Formula I were screened for their ability to inhibit wild type and V804M mutant RET kinase using CisBio's HTRF® KinEASE¿-TK ...
Ligand InfoPC cidPC sid
In DepthDetails US Patent
TargetProto-oncogene tyrosine-protein kinase receptor Ret(Homo sapiens (Human))
Array Biopharma
US Patent
LigandPNGBDBM320540(US10174027, Example 87)
Affinity DataIC50:  5.30nM. Assay description: Compounds of General Formula I were screened for their ability to inhibit wild type and V804M mutant RET kinase using CisBio's HTRF® KinEASE-TK a...
Ligand InfoPC cidPC sid
In DepthDetails US Patent