BDBM320569 US10174035, Compound 112::{4-[cis-2,6-Dimethylmorpholin-4-yl]piperidin-1-yl}[5-(1,3-dimethyl-1H-pyrazol-4-yl)-6-fluoro-3-methyl-7-(morpholin-4-yl)-3H-imidazo[4,5-b]pyridin-2-yl]methanone
SMILES C[C@H]1CN(C[C@@H](C)O1)C1CCN(CC1)C(=O)c1nc2c(N3CCOCC3)c(F)c(nc2n1C)-c1cn(C)nc1C
InChI Key InChIKey=BYIDUFBFOQYJSQ-HDICACEKSA-N
Data  1 IC50
  Tab Delimited (TSV)   2D SDfile   Computed 3D by Vconf -m prep SDfile
Find this compound or compounds like it in BindingDB:
Activity Spreadsheet -- Enzyme Inhibition Constant Data from BindingDB
Found 1 hit for monomerid = 320569
TargetPhosphatidylinositol 4,5-bisphosphate 3-kinase catalytic subunit delta isoform(Homo sapiens (Human))
Daiichi Sankyo
US Patent
LigandPNGBDBM320569(US10174035, Compound 112 | {4-[cis-2,6-Dimethylmor...)
Affinity DataIC50:  15nM. Assay description: The Kinase-Glo luminescent kinase assay kit (from Promega) was used to measure kinase activity. In this assay, amount of ATP remaining in solution fo...
Ligand InfoPC cidPC sid
In DepthDetails US Patent