BDBM320762 (R)- or (S)-6-(Dimethylamino)-1-(1-(3- fluoro-4-(trifluoromethyl)phenyl)ethyl)-3- (fluoromethyl)-1H-pyrazolo[3,4- d]pyrimidin-4(5H)-one::US10174037, Example 168::US10174037, Example 169
SMILES CC(c1ccc(c(F)c1)C(F)(F)F)n1nc(CF)c2c1nc([nH]c2=O)N(C)C
InChI Key
Data  4 KI
  Tab Delimited (TSV)   2D SDfile   Computed 3D by Vconf -m prep SDfile
Find this compound or compounds like it in BindingDB:
Activity Spreadsheet -- Enzyme Inhibition Constant Data from BindingDB
Found 4 hits for monomerid = 320762
TargetcGMP-dependent 3',5'-cyclic phosphodiesterase(Homo sapiens (Human))
Merck Sharp & Dohme
US Patent
LigandPNGBDBM320762((R)- or (S)-6-(Dimethylamino)-1-(1-(3- fluoro-4-(t...)
Affinity DataKi:  0.0990nM. Assay description: Performed by Lab B. The activity of the compounds in accordance with the present invention as PDE2 inhibitors may be readily determined using a fluor...
Ligand InfoPC cidPC sid
In DepthDetails US Patent
TargetPhosphodiesterase(Macaca mulatta (Rhesus macaque))
Merck Sharp & Dohme
US Patent
LigandPNGBDBM320762((R)- or (S)-6-(Dimethylamino)-1-(1-(3- fluoro-4-(t...)
Affinity DataKi:  0.200nM. Assay description: Performed by Lab B. The activity of the compounds in accordance with the present invention as PDE2 inhibitors may be readily determined using a fluor...
Ligand InfoPC cidPC sid
In DepthDetails US Patent
TargetcGMP-dependent 3',5'-cyclic phosphodiesterase(Homo sapiens (Human))
Merck Sharp & Dohme
US Patent
LigandPNGBDBM320762((R)- or (S)-6-(Dimethylamino)-1-(1-(3- fluoro-4-(t...)
Affinity DataKi:  5.30nM. Assay description: Performed by Lab B. The activity of the compounds in accordance with the present invention as PDE2 inhibitors may be readily determined using a fluor...
Ligand InfoPC cidPC sid
In DepthDetails US Patent
TargetPhosphodiesterase(Macaca mulatta (Rhesus macaque))
Merck Sharp & Dohme
US Patent
LigandPNGBDBM320762((R)- or (S)-6-(Dimethylamino)-1-(1-(3- fluoro-4-(t...)
Affinity DataKi:  8.10nM. Assay description: Performed by Lab B. The activity of the compounds in accordance with the present invention as PDE2 inhibitors may be readily determined using a fluor...
Ligand InfoPC cidPC sid
In DepthDetails US Patent