BDBM3209 (1R,2R)-2-{[2,6-dihydroxy-4-({[(3R,4R)-3-[(4-hydroxybenzene)amido]azepan-4-yl]oxy}carbonyl)phenyl]carbonyl}cyclohexane-1-carboxylic acid::4-trans-[4-(trans-2-Carboxycyclohexanoyl)-3,5-dihydroxybenzoyloxy]-3-(4-hydroxybenzamido)azepane::Modified Benzophenone Ring, Balanol Analog 9
SMILES OC(=O)[C@@H]1CCCC[C@H]1C(=O)c1c(O)cc(cc1O)C(=O)O[C@@H]1CCCNC[C@H]1NC(=O)c1ccc(O)cc1
InChI Key InChIKey=VQRRRZBHTMCDDO-GLHSZLCASA-N
Data  4 IC50
  Tab Delimited (TSV)   2D SDfile   Computed 3D by Vconf -m prep SDfile
Find this compound or compounds like it in BindingDB:
Activity Spreadsheet -- Enzyme Inhibition Constant Data from BindingDB
Found 4 hits for monomerid = 3209
TargetProtein kinase C alpha type(Homo sapiens (Human))
Sphinx Laboratories
LigandPNGBDBM3209((1R,2R)-2-{[2,6-dihydroxy-4-({[(3R,4R)-3-[(4-hydro...)
Affinity DataIC50: >1.50E+5nMpH: 7.5 T: 2°C. Assay description: PKC was assayed by quantitating the incorporation of 32P from [gamma-32P]ATP into histone type IIIs.
In DepthDetails ArticlePubMed
TargetcAMP-dependent protein kinase catalytic subunit alpha(Bos taurus (bovine))
Sphinx Laboratories
LigandPNGBDBM3209((1R,2R)-2-{[2,6-dihydroxy-4-({[(3R,4R)-3-[(4-hydro...)
Affinity DataIC50:  6.70E+3nMpH: 7.5 T: 2°C. Assay description: The activity of PKA, activated by cAMP, is measured by its ability to transfer phosphate from [gamma-32P]ATP to histone.
In DepthDetails ArticlePubMed
TargetProtein kinase C epsilon type(Homo sapiens (Human))
Sphinx Laboratories
LigandPNGBDBM3209((1R,2R)-2-{[2,6-dihydroxy-4-({[(3R,4R)-3-[(4-hydro...)
Affinity DataIC50:  4.70E+4nMpH: 7.5 T: 2°C. Assay description: PKC was assayed by quantitating the incorporation of 32P from [gamma-32P]ATP into histone type IIIs.
In DepthDetails ArticlePubMed
TargetProtein kinase C beta type(Homo sapiens (Human))
Sphinx Laboratories
LigandPNGBDBM3209((1R,2R)-2-{[2,6-dihydroxy-4-({[(3R,4R)-3-[(4-hydro...)
Affinity DataIC50: >1.50E+5nMpH: 7.5 T: 2°C. Assay description: PKC was assayed by quantitating the incorporation of 32P from [gamma-32P]ATP into histone type IIIs.
In DepthDetails ArticlePubMed