BDBM320944 (R)- or (S)-1-(1-(4- (difluoromethyl)-2- fluorophenyl)propyl)- 6-(dimethylamino)-3- (fluoromethyl)-1H- pyrazolo[3,4- d]pyrimidin-4(5H)-one::US10174037, Example 348::US10174037, Example 349
SMILES CCC(c1ccc(cc1F)C(F)F)n1nc(CF)c2c1nc([nH]c2=O)N(C)C
InChI Key
Data  2 KI
  Tab Delimited (TSV)   2D SDfile   Computed 3D by Vconf -m prep SDfile
Find this compound or compounds like it in BindingDB:
Activity Spreadsheet -- Enzyme Inhibition Constant Data from BindingDB
Found 2 hits for monomerid = 320944
TargetcGMP-dependent 3',5'-cyclic phosphodiesterase(Homo sapiens (Human))
Merck Sharp & Dohme
US Patent
LigandPNGBDBM320944((R)- or (S)-1-(1-(4- (difluoromethyl)-2- fluorophe...)
Affinity DataKi:  0.0300nM. Assay description: Performed by Lab B. The activity of the compounds in accordance with the present invention as PDE2 inhibitors may be readily determined using a fluor...
Ligand InfoPC cidPC sid
In DepthDetails US Patent
TargetcGMP-dependent 3',5'-cyclic phosphodiesterase(Homo sapiens (Human))
Merck Sharp & Dohme
US Patent
LigandPNGBDBM320944((R)- or (S)-1-(1-(4- (difluoromethyl)-2- fluorophe...)
Affinity DataKi:  4nM. Assay description: Performed by Lab B. The activity of the compounds in accordance with the present invention as PDE2 inhibitors may be readily determined using a fluor...
Ligand InfoPC cidPC sid
In DepthDetails US Patent