BDBM320984 4-Amino-7-[(2R,3R,4S,5R)-3,4-dihydroxy-5-[(sulfamoylamino)methyl]tetrahydrofuran-2-yl]-5-[2-(2-pyridyl)ethynyl]pyrrolo[2,3-d]pyrimidine::US10174040, Example 44
SMILES Nc1ncnc2n(cc(C#Cc3ccccn3)c12)[C@@H]1O[C@H](CNS(N)(=O)=O)[C@@H](O)[C@H]1O
InChI Key InChIKey=LCPMCJDWHGBFKZ-SCFUHWHPSA-N
Data  1 IC50
  Tab Delimited (TSV)   2D SDfile   Computed 3D by Vconf -m prep SDfile
Find this compound or compounds like it in BindingDB:
Activity Spreadsheet -- Enzyme Inhibition Constant Data from BindingDB
Found 1 hit for monomerid = 320984
TargetNEDD8-conjugating enzyme UBE2F(Homo sapiens (Human))
Taiho Pharmaceutical
US Patent
LigandPNGBDBM320984(4-Amino-7-[(2R,3R,4S,5R)-3,4-dihydroxy-5-[(sulfamo...)
Affinity DataIC50:  29nM. Assay description: A purified NAE (heterodimer of APPBP1 and UBA3) solution was prepared in the following manner. The human APPBP1 gene (NCBI Reference Sequence number:...
Ligand InfoPC cidPC sid
In DepthDetails US Patent