BDBM321081 (S)-8-((2-amino-2,4-dimethylpentyl)oxy)-7-chloro-4,5-dimethylbenzo[c][1,7]naphthyridin-6(5H)-one::US10174044, Example 15
SMILES CC(C)C[C@](C)(N)COc1ccc2c3ccnc(C)c3n(C)c(=O)c2c1Cl
InChI Key InChIKey=KPGYMYSACVOLRP-NRFANRHFSA-N
Data  1 IC50
  Tab Delimited (TSV)   2D SDfile   Computed 3D by Vconf -m prep SDfile
Find this compound or compounds like it in BindingDB:
Activity Spreadsheet -- Enzyme Inhibition Constant Data from BindingDB
Found 1 hit for monomerid = 321081
TargetAP2-associated protein kinase 1(Homo sapiens (Human))
Bristol-Myers Squibb
US Patent
LigandPNGBDBM321081((S)-8-((2-amino-2,4-dimethylpentyl)oxy)-7-chloro-4...)
Affinity DataIC50:  59nM. Assay description: The assays were performed in U-bottom 384-well plates. The final assay volume was 30 μl prepared from 15 μl additions of enzyme and substra...
Ligand InfoPC cidPC sid
In DepthDetails US Patent