BDBM321084 (S)-8-((2-amino-2,4-dimethylpentyl)oxy)-5-ethyl-4-methylbenzo[c][1,7]naphthyridin-6(5H)-one::US10174044, Example 19
SMILES CCn1c2c(C)nccc2c2ccc(OC[C@@](C)(N)CC(C)C)cc2c1=O
InChI Key InChIKey=CTIRHFQJZBZNMZ-QFIPXVFZSA-N
Data  1 IC50
  Tab Delimited (TSV)   2D SDfile   Computed 3D by Vconf -m prep SDfile
Find this compound or compounds like it in BindingDB:
Activity Spreadsheet -- Enzyme Inhibition Constant Data from BindingDB
Found 1 hit for monomerid = 321084
TargetAP2-associated protein kinase 1(Homo sapiens (Human))
Bristol-Myers Squibb
US Patent
LigandPNGBDBM321084((S)-8-((2-amino-2,4-dimethylpentyl)oxy)-5-ethyl-4-...)
Affinity DataIC50:  1.34E+3nM. Assay description: The assays were performed in U-bottom 384-well plates. The final assay volume was 30 μl prepared from 15 μl additions of enzyme and substra...
Ligand InfoPC cidPC sid
In DepthDetails US Patent