BDBM321103 (S)¿N-(8-((2-amino-2,4-dimethylpentyl)oxy)-6H-isochromeno[3,4-c]pyridin-2-yl)acetamide::US10174044, Example 37
SMILES CC(C)C[C@](C)(N)COc1ccc-2c(COc3cnc(NC(C)=O)cc-23)c1
InChI Key InChIKey=JQBRGIXUPJGJKV-NRFANRHFSA-N
Data  1 IC50
  Tab Delimited (TSV)   2D SDfile   Computed 3D by Vconf -m prep SDfile
Find this compound or compounds like it in BindingDB:
Activity Spreadsheet -- Enzyme Inhibition Constant Data from BindingDB
Found 1 hit for monomerid = 321103
TargetAP2-associated protein kinase 1(Homo sapiens (Human))
Bristol-Myers Squibb
US Patent
LigandPNGBDBM321103((S)¿N-(8-((2-amino-2,4-dimethylpentyl)oxy)-6H-isoc...)
Affinity DataIC50:  2.40nM. Assay description: The assays were performed in U-bottom 384-well plates. The final assay volume was 30 μl prepared from 15 μl additions of enzyme and substra...
Ligand InfoPC cidPC sid
In DepthDetails US Patent