BDBM321165 US10174049, Example 32::US10385066, Example 32::US9738658, Example 32::US9796729, 32
SMILES COc1ncc(cn1)-n1ccc2cc(ccc12)N1CCOc2ncnc(N)c2C1=O
InChI Key InChIKey=YUHFMTOFNXJCRY-UHFFFAOYSA-N
Data  4 IC50
  Tab Delimited (TSV)   2D SDfile   Computed 3D by Vconf -m prep SDfile
Find this compound or compounds like it in BindingDB:
Activity Spreadsheet -- Enzyme Inhibition Constant Data from BindingDB
Found 4 hits for monomerid = 321165
TargetDiacylglycerol O-acyltransferase 1(Homo sapiens (Human))
Glaxosmithkline
US Patent
LigandPNGBDBM321165(US10174049, Example 32 | US10385066, Example 32 | ...)
Affinity DataIC50:  38.1nM. Assay description: For inhibition of triacylglycerol product formation, 11 uL reactions were run in white Polyplate-384 (PerkinElmer6007300) starting with a 30 minute p...
Ligand InfoPC cidPC sid
In DepthDetails US Patent
TargetDiacylglycerol O-acyltransferase 1(Homo sapiens (Human))
Glaxosmithkline
US Patent
LigandPNGBDBM321165(US10174049, Example 32 | US10385066, Example 32 | ...)
Affinity DataIC50:  38.1nM. Assay description: LE assay: For inhibition of triacylglycerol product formation, 11 uL, reactions were nm in white Polyplate-384 (PerkinElmer6007300) starting with a 3...
Ligand InfoPC cidPC sid
In DepthDetails US Patent
TargetDiacylglycerol O-acyltransferase 1(Homo sapiens (Human))
Glaxosmithkline
US Patent
LigandPNGBDBM321165(US10174049, Example 32 | US10385066, Example 32 | ...)
Affinity DataIC50:  38.1nM. Assay description: For inhibition of triacylglycerol product formation, 11 uL reactions were run in white Polyplate-384 (PerkinElmer6007300) starting with a 30 minute p...
Ligand InfoPC cidPC sid
In DepthDetails US Patent
TargetDiacylglycerol O-acyltransferase 1(Homo sapiens (Human))
Glaxosmithkline
US Patent
LigandPNGBDBM321165(US10174049, Example 32 | US10385066, Example 32 | ...)
Affinity DataIC50:  38.1nM. Assay description: For inhibition of triacylglycerol product formation, 11 uL reactions were run in white Polyplate-384 (PerkinElmer6007300) starting with a 30 minute p...
Ligand InfoPC cidPC sid
In DepthDetails US Patent