BDBM321200 US10179123, Example 2-21::US10179123, Example 2-21-1
SMILES COC(=O)c1cc2nc(Cc3ccc(OC(F)(F)F)cc3)n([C@H]3C[C@@H](C)CC(C)(C)C3)c2cc1OCC(F)(F)F
InChI Key InChIKey=OPRNNFKOYJFURX-AEFFLSMTSA-N
Data  2 IC50
  Tab Delimited (TSV)   2D SDfile   Computed 3D by Vconf -m prep SDfile
Find this compound or compounds like it in BindingDB:
Activity Spreadsheet -- Enzyme Inhibition Constant Data from BindingDB
Found 2 hits for monomerid = 321200
TargetIsocitrate dehydrogenase [NADP] cytoplasmic [R132H](Homo sapiens (Human))
Bayer Pharma Aktiengesellschaft
US Patent
LigandPNGBDBM321200(US10179123, Example 2-21 | US10179123, Example 2-2...)
Affinity DataIC50:  5.00E+3nM. Assay description: mIDH1 catalyzes the NADPH-dependent reduction of alpha-ketoglutarate (α-KG) to (2R)-2-hydroxyglutarate (2-HG). NADPH consumption was measured by...
Ligand InfoPC cidPC sid
In DepthDetails US Patent
TargetIsocitrate dehydrogenase [NADP] cytoplasmic [R132H](Homo sapiens (Human))
Bayer Pharma Aktiengesellschaft
US Patent
LigandPNGBDBM321200(US10179123, Example 2-21 | US10179123, Example 2-2...)
Affinity DataIC50: >1.00E+4nM. Assay description: mIDH1 catalyzes the NADPH-dependent reduction of alpha-ketoglutarate (α-KG) to (2R)-2-hydroxyglutarate (2-HG). NADPH consumption was measured by...
Ligand InfoPC cidPC sid
In DepthDetails US Patent