BDBM321208 US10179123, Example 2-27
SMILES COC(=O)CCc1cc2nc(Cc3ccc(OC(F)(F)F)cc3)n([C@H]3C[C@@H](C)CC(C)(C)C3)c2cc1C
InChI Key InChIKey=XHTZIFCBULPIHS-GCJKJVERSA-N
Data  1 IC50
  Tab Delimited (TSV)   2D SDfile   Computed 3D by Vconf -m prep SDfile
Find this compound or compounds like it in BindingDB:
Activity Spreadsheet -- Enzyme Inhibition Constant Data from BindingDB
Found 1 hit for monomerid = 321208
TargetIsocitrate dehydrogenase [NADP] cytoplasmic [R132H](Homo sapiens (Human))
Bayer Pharma Aktiengesellschaft
US Patent
LigandPNGBDBM321208(US10179123, Example 2-27)
Affinity DataIC50:  180nM. Assay description: mIDH1 catalyzes the NADPH-dependent reduction of alpha-ketoglutarate (α-KG) to (2R)-2-hydroxyglutarate (2-HG). NADPH consumption was measured by...
Ligand InfoPC cidPC sid
In DepthDetails US Patent