BDBM321237 US10179123, Example 2-44-2
SMILES C[C@@H]1C[C@@H](CC(C)(C)C1)n1c(Cc2ccc(OC(F)(F)F)cc2)nc2cc(C(O)=O)c(C)cc12
InChI Key InChIKey=CCTMIENZLLMTEM-QAPCUYQASA-N
Data  1 IC50
  Tab Delimited (TSV)   2D SDfile   Computed 3D by Vconf -m prep SDfile
Find this compound or compounds like it in BindingDB:
Activity Spreadsheet -- Enzyme Inhibition Constant Data from BindingDB
Found 1 hit for monomerid = 321237
TargetIsocitrate dehydrogenase [NADP] cytoplasmic [R132H](Homo sapiens (Human))
Bayer Pharma Aktiengesellschaft
US Patent
LigandPNGBDBM321237(US10179123, Example 2-44-2)
Affinity DataIC50:  130nM. Assay description: mIDH1 catalyzes the NADPH-dependent reduction of alpha-ketoglutarate (α-KG) to (2R)-2-hydroxyglutarate (2-HG). NADPH consumption was measured by...
Ligand InfoPC cidPC sid
In DepthDetails US Patent