BDBM321317 US10179791, Compound 141::US10807991, Compound 141
SMILES OC(=O)CCN1CCC2(COc3cc(SCc4c(Cl)cccc4C4CC4)ccc23)CC1
InChI Key InChIKey=IVMRVTZLOLUEGD-UHFFFAOYSA-N
Data  6 EC50
  Tab Delimited (TSV)   2D SDfile   Computed 3D by Vconf -m prep SDfile
Find this compound or compounds like it in BindingDB:
Activity Spreadsheet -- Enzyme Inhibition Constant Data from BindingDB
Found 6 hits for monomerid = 321317
TargetSphingosine 1-phosphate receptor 5(Homo sapiens (Human))
Abbvie
US Patent
LigandPNGBDBM321317(US10179791, Compound 141 | US10807991, Compound 14...)
Affinity DataEC50:  6.31nM. Assay description: The CHO-human-S1P5-Aeqorin assay was bought from Euroscreen, Brussels (Euroscreen, Technical dossier, Human Lysophospholid S1P5 (Edg8) receptor, DNA ...
Ligand InfoPC cidPC sid
In DepthDetails US Patent
TargetSphingosine 1-phosphate receptor 1(Homo sapiens (Human))
Abbvie
US Patent
LigandPNGBDBM321317(US10179791, Compound 141 | US10807991, Compound 14...)
Affinity DataEC50:  316nM. Assay description: The CHO-K1-human-S1P1-Aeqorin assay was bought from Euroscreen Fast, Brussels (Euroscreen, Technical dossier, Human S1P1 (Edg1) receptor, DNA clone a...
Ligand InfoPC cidPC sid
In DepthDetails US Patent
TargetSphingosine 1-phosphate receptor 3(Homo sapiens (Human))
Abbvie
US Patent
LigandPNGBDBM321317(US10179791, Compound 141 | US10807991, Compound 14...)
Affinity DataEC50: >1.00E+4nM. Assay description: The CHO-human-S1P3-Aeqorin assay (CHO/Gal6/AEQ/h-S1P3) was established at Solvay Pharmaceuticals. The plasmid DNA coding for the S1P3 receptor (acces...
Ligand InfoPC cidPC sid
In DepthDetails US Patent
TargetSphingosine 1-phosphate receptor 5(Homo sapiens (Human))
Abbvie
US Patent
LigandPNGBDBM321317(US10179791, Compound 141 | US10807991, Compound 14...)
Affinity DataEC50:  6.31nM. Assay description: The CHO-human-S1P5-Aeqorin assay was bought from Euroscreen, Brussels (Euroscreen, Technical dossier, Human Lysophospholid S1P5 (Edg8) receptor, DNA ...
Ligand InfoPC cidPC sid
In DepthDetails US Patent
TargetSphingosine 1-phosphate receptor 1(Homo sapiens (Human))
Abbvie
US Patent
LigandPNGBDBM321317(US10179791, Compound 141 | US10807991, Compound 14...)
Affinity DataEC50:  316nM. Assay description: The CHO-K1-human-S1P1-Aeqorin assay was bought from Euroscreen Fast, Brussels (Euroscreen, Technical dossier, Human S1P1 (Edg1) receptor, DNA clone a...
Ligand InfoPC cidPC sid
In DepthDetails US Patent
TargetSphingosine 1-phosphate receptor 3(Homo sapiens (Human))
Abbvie
US Patent
LigandPNGBDBM321317(US10179791, Compound 141 | US10807991, Compound 14...)
Affinity DataEC50: <1.00E+4nM. Assay description: The CHO-human-S1P3-Aeqorin assay (CHO/Gα16/AEQ/h-S1P3) was established at Solvay Pharmaceuticals. The plasmid DNA coding for the S1P3 receptor (...
Ligand InfoPC cidPC sid
In DepthDetails US Patent