BDBM321319 US10179791, Compound 153::US10807991, Compound 153
SMILES CC(CN1CCC2(COc3cc(SCc4c(Cl)cccc4Cl)ccc23)CC1)C(O)=O
InChI Key InChIKey=YCQUARVBELEPJE-UHFFFAOYSA-N
Data  4 EC50
  Tab Delimited (TSV)   2D SDfile   Computed 3D by Vconf -m prep SDfile
Find this compound or compounds like it in BindingDB:
Activity Spreadsheet -- Enzyme Inhibition Constant Data from BindingDB
Found 4 hits for monomerid = 321319
TargetSphingosine 1-phosphate receptor 5(Homo sapiens (Human))
Abbvie
US Patent
LigandPNGBDBM321319(US10179791, Compound 153 | US10807991, Compound 15...)
Affinity DataEC50:  12.6nM. Assay description: The CHO-human-S1P5-Aeqorin assay was bought from Euroscreen, Brussels (Euroscreen, Technical dossier, Human Lysophospholid S1P5 (Edg8) receptor, DNA ...
Ligand InfoPC cidPC sid
In DepthDetails US Patent
TargetSphingosine 1-phosphate receptor 1(Homo sapiens (Human))
Abbvie
US Patent
LigandPNGBDBM321319(US10179791, Compound 153 | US10807991, Compound 15...)
Affinity DataEC50:  1.00E+3nM. Assay description: The CHO-K1-human-S1P1-Aeqorin assay was bought from Euroscreen Fast, Brussels (Euroscreen, Technical dossier, Human S1P1 (Edg1) receptor, DNA clone a...
Ligand InfoPC cidPC sid
In DepthDetails US Patent
TargetSphingosine 1-phosphate receptor 5(Homo sapiens (Human))
Abbvie
US Patent
LigandPNGBDBM321319(US10179791, Compound 153 | US10807991, Compound 15...)
Affinity DataEC50:  12.6nM. Assay description: The CHO-human-S1P5-Aeqorin assay was bought from Euroscreen, Brussels (Euroscreen, Technical dossier, Human Lysophospholid S1P5 (Edg8) receptor, DNA ...
Ligand InfoPC cidPC sid
In DepthDetails US Patent
TargetSphingosine 1-phosphate receptor 1(Homo sapiens (Human))
Abbvie
US Patent
LigandPNGBDBM321319(US10179791, Compound 153 | US10807991, Compound 15...)
Affinity DataEC50:  1.00E+3nM. Assay description: The CHO-K1-human-S1P1-Aeqorin assay was bought from Euroscreen Fast, Brussels (Euroscreen, Technical dossier, Human S1P1 (Edg1) receptor, DNA clone a...
Ligand InfoPC cidPC sid
In DepthDetails US Patent