BDBM321350 3-(6-isobutyl-7-oxo-1H-pyrrolo[2,3-c]pyridin-4-yl)-N,N-dimethyl-benzamide::US10183009, Example 16
SMILES CC(C)Cn1cc(-c2cccc(c2)C(=O)N(C)C)c2cc[nH]c2c1=O
InChI Key InChIKey=WLYBHRGEYCTQTQ-UHFFFAOYSA-N
Data  1 IC50
  Tab Delimited (TSV)   2D SDfile   Computed 3D by Vconf -m prep SDfile
Find this compound or compounds like it in BindingDB:
Activity Spreadsheet -- Enzyme Inhibition Constant Data from BindingDB
Found 1 hit for monomerid = 321350
TargetBromodomain-containing protein 4 [42-168](Homo sapiens (Human))
Genentech
US Patent
LigandPNGBDBM321350(3-(6-isobutyl-7-oxo-1H-pyrrolo[2,3-c]pyridin-4-yl)...)
Affinity DataIC50:  8.00E+3nM. Assay description: His/Flag epitope tagged BRD4 BD142-168 was cloned, expressed, and purified to homogeneity. BRD4 binding and inhibition was assessed by monitoring the...
Ligand InfoPC cidPC sid
In DepthDetails US Patent