BDBM321351 4-[6-[(E)-but-2-enyl]-7-oxo-1H-pyrrolo[2,3-c]pyridin-4-yl]-2-fluoro-benzamide::US10183009, Example 20
SMILES C\C=C\Cn1cc(-c2ccc(C(N)=O)c(F)c2)c2cc[nH]c2c1=O
InChI Key InChIKey=FVNRTPMUPSGNHV-NSCUHMNNSA-N
Data  1 IC50
  Tab Delimited (TSV)   2D SDfile   Computed 3D by Vconf -m prep SDfile
Find this compound or compounds like it in BindingDB:
Activity Spreadsheet -- Enzyme Inhibition Constant Data from BindingDB
Found 1 hit for monomerid = 321351
TargetBromodomain-containing protein 4 [42-168](Homo sapiens (Human))
Genentech
US Patent
LigandPNGBDBM321351(4-[6-[(E)-but-2-enyl]-7-oxo-1H-pyrrolo[2,3-c]pyrid...)
Affinity DataIC50:  890nM. Assay description: His/Flag epitope tagged BRD4 BD142-168 was cloned, expressed, and purified to homogeneity. BRD4 binding and inhibition was assessed by monitoring the...
Ligand InfoPC cidPC sid
In DepthDetails US Patent