BDBM321384 3-({[(1R)-6-(2-cyclopropylethoxy)-1,2,3,4- tetrahydronaphthalen-1-yl]methyl}amino) pyridine-4-carboxylic acid::US10179769, Example 98::US10807956, Example 98::US11214542, Example 98::US11639333, Example 98
SMILES OC(=O)c1ccncc1NC[C@@H]1CCCc2cc(OCCC3CC3)ccc12
InChI Key InChIKey=QZFPSJUPRDBWML-KRWDZBQOSA-N
Data  2 IC50
  Tab Delimited (TSV)   2D SDfile   Computed 3D by Vconf -m prep SDfile
Find this compound or compounds like it in BindingDB:
Activity Spreadsheet -- Enzyme Inhibition Constant Data from BindingDB
Found 2 hits for monomerid = 321384
TargetLysine-specific demethylase 4C(Homo sapiens (Human))
Celgene Quanticel Research
US Patent
LigandPNGBDBM321384(3-({[(1R)-6-(2-cyclopropylethoxy)-1,2,3,4- tetrahy...)
Affinity DataIC50: >100nM. Assay description: JMJD2C: The ability of test compounds to inhibit the activity of JMJD2C was determined in 384-well plate format under the following reaction conditio...
Ligand InfoPC cidPC sid
In DepthDetails US Patent
TargetLysine-specific demethylase 5B(Homo sapiens (Human))
Celgene Quanticel Research
US Patent
LigandPNGBDBM321384(3-({[(1R)-6-(2-cyclopropylethoxy)-1,2,3,4- tetrahy...)
Affinity DataIC50:  5.50E+3nM. Assay description: The ability of test compounds to inhibit the activity of JMJD2C was determined in 384-well plate format under the following reaction conditions: 0.3 ...
Ligand InfoPC cidPC sid
In DepthDetails US Patent