BDBM321403 6-butyl-4-(4-(2-hydroxypropan-2-yl)phenyl)-1H-pyrrolo[2,3-c]pyridin-7(6H)-one::US10183009, Example 82
SMILES CCCCn1cc(-c2ccc(cc2)C(C)(C)O)c2cc[nH]c2c1=O
InChI Key InChIKey=XZTAMGFSPMGJSF-UHFFFAOYSA-N
Data  1 IC50
  Tab Delimited (TSV)   2D SDfile   Computed 3D by Vconf -m prep SDfile
Find this compound or compounds like it in BindingDB:
Activity Spreadsheet -- Enzyme Inhibition Constant Data from BindingDB
Found 1 hit for monomerid = 321403
TargetBromodomain-containing protein 9 [134-239](Homo sapiens (Human))
Genentech
US Patent
LigandPNGBDBM321403(6-butyl-4-(4-(2-hydroxypropan-2-yl)phenyl)-1H-pyrr...)
Affinity DataIC50:  43nM. Assay description: His/Flag epitope tagged BRD9134-239 was cloned, expressed, and purified to homogeneity. BRD9 binding and inhibition was assessed by monitoring the en...
Ligand InfoPC cidPC sid
In DepthDetails US Patent