BDBM321454 6-but-2-enyl-4-[4-(hydroxymethyl)phenyl]-1H-pyrrolo[2,3-c]pyridin-7-one::US10183009, Example 29
SMILES CC=CCn1cc(-c2ccc(CO)cc2)c2cc[nH]c2c1=O
InChI Key InChIKey=BIILPMWMWVWYFL-NSCUHMNNSA-N
Data  1 IC50
  Tab Delimited (TSV)   2D SDfile   Computed 3D by Vconf -m prep SDfile
Find this compound or compounds like it in BindingDB:
Activity Spreadsheet -- Enzyme Inhibition Constant Data from BindingDB
Found 1 hit for monomerid = 321454
TargetChromatin remodeling regulator CECR2 [424-538](Homo sapiens (Human))
Genentech
US Patent
LigandPNGBDBM321454(6-but-2-enyl-4-[4-(hydroxymethyl)phenyl]-1H-pyrrol...)
Affinity DataIC50:  4.50E+3nM. Assay description: His/Flag epitope tagged TAF1-BD21504-1635 was cloned, expressed, and purified to homogeneity. TAF1-BD2 binding and inhibition was assessed by monitor...
Ligand InfoPC cidPC sid
In DepthDetails US Patent