BDBM321529 US10183021, Compound I-111::US10183021, Compound I-339
SMILES Fc1ccccc1Cn1nc(cc1-c1ccon1)-c1ncc(F)c(n1)N1CCc2ccccc2C1
InChI Key InChIKey=KTWNLJKQMHVGDA-UHFFFAOYSA-N
Data  2 EC50
  Tab Delimited (TSV)   2D SDfile   Computed 3D by Vconf -m prep SDfile
Find this compound or compounds like it in BindingDB:
Activity Spreadsheet -- Enzyme Inhibition Constant Data from BindingDB
Found 2 hits for monomerid = 321529
TargetGuanylate cyclase soluble subunit alpha-1(Homo sapiens (Human))
Ironwood Pharmaceuticals
US Patent
LigandPNGBDBM321529(US10183021, Compound I-111 | US10183021, Compound ...)
Affinity DataEC50: <100nM. Assay description: Human embryonic kidney cells (HEK293), endogenously expressing soluble guanylate cyclase (sGC), were used to evaluate the activity of test compounds....
Ligand InfoPC cidPC sid
In DepthDetails US Patent
TargetGuanylate cyclase soluble subunit alpha-1(Homo sapiens (Human))
Ironwood Pharmaceuticals
US Patent
LigandPNGBDBM321529(US10183021, Compound I-111 | US10183021, Compound ...)
Affinity DataEC50: <100nM. Assay description: Human embryonic kidney cells (HEK293), endogenously expressing soluble guanylate cyclase (sGC), were used to evaluate the activity of test compounds....
Ligand InfoPC cidPC sid
In DepthDetails US Patent